tct_compile_result_with_package.txt 15.3 KB
Newer Older
sarendt's avatar
sarendt committed
1 2 3 4 5 6 7 8 9 10 11 12 13 14 15 16 17 18 19 20 21 22 23 24 25 26 27 28 29 30 31 32 33 34 35 36 37 38 39 40 41 42 43 44 45 46 47 48 49 50 51 52 53 54 55 56 57 58 59 60 61 62 63 64 65 66 67 68 69 70 71 72 73 74 75 76 77 78 79 80 81 82 83 84 85 86 87 88 89 90 91 92 93 94 95 96 97 98 99 100 101 102 103 104 105 106 107 108 109 110 111 112 113 114 115 116 117 118 119 120 121 122 123 124 125 126 127 128 129 130 131 132 133 134 135 136 137 138 139 140 141 142 143 144 145 146 147 148 149 150 151 152 153 154 155 156 157 158 159 160 161 162 163 164 165 166 167 168 169 170 171 172 173 174 175 176 177 178 179 180 181 182 183 184 185 186 187 188 189 190 191 192 193 194 195 196 197 198 199 200 201 202 203 204 205 206 207 208 209 210 211 212 213 214 215 216 217 218 219 220 221 222 223 224 225
+ Error stacktraces are turned on.
[INFO] Scanning for projects...
[INFO] Reactor build order: 
[INFO]   Comcast - Common - Parent
[INFO]   Comcast - truView - Protocol Module
[INFO]   Comcast - truView - Common Module
[INFO]   Comcast - truView - Cabletester Module
[INFO] ------------------------------------------------------------------------
[INFO] Building Comcast - Common - Parent
[INFO]    task-segment: [clean, compile, package]
[INFO] ------------------------------------------------------------------------
[INFO] [clean:clean]
[INFO] No goals needed for project - skipping
[INFO] [site:attach-descriptor]
[INFO] ------------------------------------------------------------------------
[INFO] Building Comcast - truView - Protocol Module
[INFO]    task-segment: [clean, compile, package]
[INFO] ------------------------------------------------------------------------
[INFO] [clean:clean]
[INFO] Deleting directory C:\SunriseSW\Contracting\CableLabs\TCT\2.3_truview\protocol\target
[INFO] [resources:resources]
[WARNING] Using platform encoding (Cp1252 actually) to copy filtered resources, i.e. build is platform dependent!
[INFO] skip non existing resourceDirectory C:\SunriseSW\Contracting\CableLabs\TCT\2.3_truview\protocol\src\main\resources
Downloading: http://repo1.maven.org/maven2/com/comcast/comcast-networkfilter/1.2.3/comcast-networkfilter-1.2.3.pom
[INFO] Unable to find resource 'com.comcast:comcast-networkfilter:pom:1.2.3' in repository central (http://repo1.maven.org/maven2)
Downloading: http://repo1.maven.org/maven2/com/comcast/comcast-common-util/1.5.2/comcast-common-util-1.5.2.pom
[INFO] Unable to find resource 'com.comcast:comcast-common-util:pom:1.5.2' in repository central (http://repo1.maven.org/maven2)
Downloading: http://repo1.maven.org/maven2/jpcap/jpcap/0.7/jpcap-0.7.pom
[INFO] Unable to find resource 'jpcap:jpcap:pom:0.7' in repository central (http://repo1.maven.org/maven2)
[INFO] [compiler:compile]
[INFO] Compiling 56 source files to C:\SunriseSW\Contracting\CableLabs\TCT\2.3_truview\protocol\target\classes
[INFO] [resources:resources]
[WARNING] Using platform encoding (Cp1252 actually) to copy filtered resources, i.e. build is platform dependent!
[INFO] skip non existing resourceDirectory C:\SunriseSW\Contracting\CableLabs\TCT\2.3_truview\protocol\src\main\resources
[INFO] [compiler:compile]
[INFO] Compiling 11 source files to C:\SunriseSW\Contracting\CableLabs\TCT\2.3_truview\protocol\target\classes
[INFO] [resources:testResources]
[WARNING] Using platform encoding (Cp1252 actually) to copy filtered resources, i.e. build is platform dependent!
[INFO] skip non existing resourceDirectory C:\SunriseSW\Contracting\CableLabs\TCT\2.3_truview\protocol\src\test\resources
[INFO] [compiler:testCompile]
[INFO] Compiling 22 source files to C:\SunriseSW\Contracting\CableLabs\TCT\2.3_truview\protocol\target\test-classes
[INFO] [surefire:test]
[INFO] Surefire report directory: C:\SunriseSW\Contracting\CableLabs\TCT\2.3_truview\protocol\target\surefire-reports

-------------------------------------------------------
 T E S T S
-------------------------------------------------------
Running com.comcast.protocol.test.TestFileSystemNode
Tests run: 1, Failures: 0, Errors: 0, Skipped: 0, Time elapsed: 0.062 sec
Running com.comcast.protocol.test.TestDsmccCarousel
log4j:WARN No appenders could be found for logger (com.comcast.dsmcc.DSMCCCarousel).
log4j:WARN Please initialize the log4j system properly.
Tests run: 1, Failures: 0, Errors: 0, Skipped: 0, Time elapsed: 0.031 sec
Running com.comcast.protocol.test.TestVctSection
Tests run: 2, Failures: 0, Errors: 0, Skipped: 0, Time elapsed: 0.016 sec
Running com.comcast.protocol.test.TestModule
Tests run: 2, Failures: 0, Errors: 0, Skipped: 0, Time elapsed: 0.015 sec
Running com.comcast.protocol.test.TestNitSection
ByteBuffer, currentLocation is:0(0)
0000    0104 0258 0100 0000 0500 5808 0000 0005     ...X......X.....
0010    0019 0000 0000 0800 5810 0000 0005 00a8     ........X.......
0020                                                                

ByteBuffer, currentLocation is:6(6)
0000    0104 0258 0100 0000 0500 5808 0000 0005     ...X......X.....
0010    0019 0000 0000 0800 5810 0000 0005 00a8     ........X.......
0020                                                                

Tests run: 1, Failures: 0, Errors: 0, Skipped: 0, Time elapsed: 0.032 sec
Running com.comcast.protocol.test.TestXait
Tests run: 1, Failures: 0, Errors: 0, Skipped: 0, Time elapsed: 0.031 sec
Running com.comcast.protocol.test.TestChannel
Tests run: 2, Failures: 0, Errors: 0, Skipped: 0, Time elapsed: 0.047 sec
Running com.comcast.protocol.test.TestEvent
Tests run: 2, Failures: 0, Errors: 0, Skipped: 0, Time elapsed: 0.015 sec
Running com.comcast.protocol.test.TestDsmccSection
Tests run: 4, Failures: 0, Errors: 0, Skipped: 0, Time elapsed: 0.032 sec
Running com.comcast.protocol.test.TestDsmccUnConfig
Tests run: 3, Failures: 0, Errors: 0, Skipped: 0, Time elapsed: 0.031 sec
Running com.comcast.protocol.test.TestNTTSection
Tests run: 1, Failures: 0, Errors: 0, Skipped: 0, Time elapsed: 0.015 sec
Running com.comcast.protocol.test.TestDbwBlock
Tests run: 2, Failures: 0, Errors: 0, Skipped: 0, Time elapsed: 0.016 sec
Running com.comcast.protocol.test.TestProgram
Tests run: 3, Failures: 0, Errors: 0, Skipped: 0, Time elapsed: 0 sec
Running com.comcast.protocol.test.TestProgramAssociationTable
Tests run: 2, Failures: 0, Errors: 0, Skipped: 0, Time elapsed: 0.032 sec
Running com.comcast.protocol.test.TestBlockDescriptor
Tests run: 1, Failures: 0, Errors: 0, Skipped: 0, Time elapsed: 0.015 sec
Running com.comcast.protocol.test.TestDBWPControl
Tests run: 1, Failures: 0, Errors: 0, Skipped: 0, Time elapsed: 0.047 sec
Running com.comcast.protocol.test.TestModuleInfo
Tests run: 1, Failures: 0, Errors: 0, Skipped: 0, Time elapsed: 0.016 sec
Running com.comcast.protocol.test.TestModulationMode
Tests run: 1, Failures: 0, Errors: 0, Skipped: 0, Time elapsed: 0.015 sec
Running com.comcast.protocol.test.TestApplication
Tests run: 4, Failures: 0, Errors: 0, Skipped: 0, Time elapsed: 0.032 sec
Running com.comcast.protocol.test.TestService
Tests run: 4, Failures: 0, Errors: 0, Skipped: 0, Time elapsed: 0.031 sec
Running com.comcast.protocol.test.TestServiceInformation
ByteBuffer, currentLocation is:0(0)
0000    0104 0258 0100 0000 0500 5808 0000 0005     ...X......X.....
0010    0019 0000 0000 0800 5810 0000 0005 00a8     ........X.......
0020                                                                

Tests run: 3, Failures: 0, Errors: 0, Skipped: 0, Time elapsed: 0.032 sec

Results :

Tests run: 42, Failures: 0, Errors: 0, Skipped: 0

[INFO] [jar:jar]
[INFO] Building jar: C:\SunriseSW\Contracting\CableLabs\TCT\2.3_truview\protocol\target\comcast-truview-protocol-2.3.0-SNAPSHOT.jar
[INFO] [proguard:proguard {execution: default}]
[INFO] execute ProGuard [-injars, 'C:\SunriseSW\Contracting\CableLabs\TCT\2.3_truview\protocol\target\comcast-truview-protocol-2.3.0-SNAPSHOT_proguard_base.jar'(!META-INF/maven/**), -outjars, 'C:\SunriseSW\Contracting\CableLabs\TCT\2.3_truview\protocol\target\comcast-truview-protocol-2.3.0-SNAPSHOT.jar', -include, 'C:\SunriseSW\Contracting\CableLabs\TCT\2.3_truview\proguard2.conf', -libraryjars, 'C:\Documents and Settings\Steve\.m2\repository\com\comcast\comcast-protocol-dcii\1.0-SNAPSHOT\comcast-protocol-dcii-1.0-SNAPSHOT.jar', -libraryjars, 'C:\Documents and Settings\Steve\.m2\repository\com\comcast\comcast-networkfilter\1.2.3\comcast-networkfilter-1.2.3.jar', -libraryjars, 'C:\Documents and Settings\Steve\.m2\repository\log4j\log4j\1.2.14\log4j-1.2.14.jar', -libraryjars, 'C:\Documents and Settings\Steve\.m2\repository\com\comcast\comcast-common-util\1.5.2\comcast-common-util-1.5.2.jar', -libraryjars, 'C:\Documents and Settings\Steve\.m2\repository\jpcap\jpcap\0.7\jpcap-0.7.jar', -libraryjars, 'C:\Program Files\Java\jdk1.6.0_13\jre/lib/rt.jar', -printmapping, 'C:\SunriseSW\Contracting\CableLabs\TCT\2.3_truview\protocol\target\proguard_map.txt', -printseeds, 'C:\SunriseSW\Contracting\CableLabs\TCT\2.3_truview\protocol\target\proguard_seeds.txt']
[INFO] proguard jar: C:\Documents and Settings\Steve\.m2\repository\net\sf\proguard\proguard\4.2\proguard-4.2.jar
 [proguard] ProGuard, version 4.2
 [proguard] Reading input...
 [proguard] Reading program jar [C:\SunriseSW\Contracting\CableLabs\TCT\2.3_truview\protocol\target\comcast-truview-protocol-2.3.0-SNAPSHOT_proguard_base.jar] (filtered)
 [proguard] Reading library jar [C:\Documents and Settings\Steve\.m2\repository\com\comcast\comcast-protocol-dcii\1.0-SNAPSHOT\comcast-protocol-dcii-1.0-SNAPSHOT.jar]
 [proguard] Reading library jar [C:\Documents and Settings\Steve\.m2\repository\com\comcast\comcast-networkfilter\1.2.3\comcast-networkfilter-1.2.3.jar]
 [proguard] Reading library jar [C:\Documents and Settings\Steve\.m2\repository\log4j\log4j\1.2.14\log4j-1.2.14.jar]
 [proguard] Reading library jar [C:\Documents and Settings\Steve\.m2\repository\com\comcast\comcast-common-util\1.5.2\comcast-common-util-1.5.2.jar]
 [proguard] Reading library jar [C:\Documents and Settings\Steve\.m2\repository\jpcap\jpcap\0.7\jpcap-0.7.jar]
 [proguard] Reading library jar [C:\Program Files\Java\jdk1.6.0_13\jre\lib\rt.jar]
 [proguard] Initializing...
 [proguard] Ignoring unused library classes...
 [proguard]   Original number of library classes: 10819
 [proguard]   Final number of library classes:    188
 [proguard] Printing kept classes, fields, and methods...
 [proguard] Shrinking...
 [proguard] Removing unused program classes and class elements...
 [proguard]   Original number of program classes: 56
 [proguard]   Final number of program classes:    54
 [proguard] Inlining subroutines...
 [proguard] Optimizing...
 [proguard]   Number of inlined interfaces:             0
 [proguard]   Number of finalized classes:              9
 [proguard]   Number of privatized fields:              12
 [proguard]   Number of privatized methods:             1
 [proguard]   Number of staticized methods:             2
 [proguard]   Number of finalized methods:              4
 [proguard]   Number of removed write-only fields:      24
 [proguard]   Number of inlined constant fields:        3
 [proguard]   Number of inlined constant methods:       0
 [proguard]   Number of simplified method declarations: 2
 [proguard]   Number of removed parameters:             4
 [proguard]   Number of removed local variables:        69
 [proguard]   Number of inlined method calls:           13
 [proguard]   Number of removed exception blocks:       3
 [proguard]   Number of merged code blocks:             0
 [proguard]   Number of simplified push instructions:   22
 [proguard]   Number of simplified branches:            3
 [proguard]   Number of removed instructions:           287
 [proguard]   Number of peephole optimizations:         370
 [proguard] Shrinking...
 [proguard] Removing unused program classes and class elements...
 [proguard]   Original number of program classes: 54
 [proguard]   Final number of program classes:    52
 [proguard] Obfuscating...
 [proguard] Printing mapping to [C:\SunriseSW\Contracting\CableLabs\TCT\2.3_truview\protocol\target\proguard_map.txt]...
 [proguard] Preverifying...
 [proguard] Writing output...
 [proguard] Preparing output jar [C:\SunriseSW\Contracting\CableLabs\TCT\2.3_truview\protocol\target\comcast-truview-protocol-2.3.0-SNAPSHOT.jar]
 [proguard]   Copying resources from program jar [C:\SunriseSW\Contracting\CableLabs\TCT\2.3_truview\protocol\target\comcast-truview-protocol-2.3.0-SNAPSHOT_proguard_base.jar] (filtered)
[INFO] ------------------------------------------------------------------------
[INFO] Building Comcast - truView - Common Module
[INFO]    task-segment: [clean, compile, package]
[INFO] ------------------------------------------------------------------------
[INFO] [clean:clean]
[INFO] Deleting directory C:\SunriseSW\Contracting\CableLabs\TCT\2.3_truview\common\target
[INFO] [resources:resources]
[WARNING] Using platform encoding (Cp1252 actually) to copy filtered resources, i.e. build is platform dependent!
[INFO] Copying 1 resource
[INFO] [compiler:compile]
[INFO] Compiling 22 source files to C:\SunriseSW\Contracting\CableLabs\TCT\2.3_truview\common\target\classes
[INFO] ------------------------------------------------------------------------
[ERROR] BUILD FAILURE
[INFO] ------------------------------------------------------------------------
[INFO] Compilation failure

C:\SunriseSW\Contracting\CableLabs\TCT\2.3_truview\common\src\main\java\com\comcast\truview\common\tunneltype\EtvPacket.java:[118,54] cannot find symbol
symbol  : variable EISSDescriptor
location: class com.comcast.etv.EISSTable

C:\SunriseSW\Contracting\CableLabs\TCT\2.3_truview\common\src\main\java\com\comcast\truview\common\tunneltype\EtvPacket.java:[129,54] cannot find symbol
symbol  : variable EISSDescriptor
location: class com.comcast.etv.EISSTable

C:\SunriseSW\Contracting\CableLabs\TCT\2.3_truview\common\src\main\java\com\comcast\truview\common\tunneltype\EtvPacket.java:[136,54] cannot find symbol
symbol  : variable EISSDescriptor
location: class com.comcast.etv.EISSTable


[INFO] ------------------------------------------------------------------------
[INFO] Trace
org.apache.maven.BuildFailureException: Compilation failure
	at org.apache.maven.lifecycle.DefaultLifecycleExecutor.executeGoals(DefaultLifecycleExecutor.java:699)
	at org.apache.maven.lifecycle.DefaultLifecycleExecutor.executeGoalWithLifecycle(DefaultLifecycleExecutor.java:540)
	at org.apache.maven.lifecycle.DefaultLifecycleExecutor.executeGoal(DefaultLifecycleExecutor.java:519)
	at org.apache.maven.lifecycle.DefaultLifecycleExecutor.executeGoalAndHandleFailures(DefaultLifecycleExecutor.java:371)
	at org.apache.maven.lifecycle.DefaultLifecycleExecutor.executeTaskSegments(DefaultLifecycleExecutor.java:332)
	at org.apache.maven.lifecycle.DefaultLifecycleExecutor.execute(DefaultLifecycleExecutor.java:181)
	at org.apache.maven.DefaultMaven.doExecute(DefaultMaven.java:356)
	at org.apache.maven.DefaultMaven.execute(DefaultMaven.java:137)
	at org.apache.maven.cli.MavenCli.main(MavenCli.java:356)
	at sun.reflect.NativeMethodAccessorImpl.invoke0(Native Method)
	at sun.reflect.NativeMethodAccessorImpl.invoke(NativeMethodAccessorImpl.java:39)
	at sun.reflect.DelegatingMethodAccessorImpl.invoke(DelegatingMethodAccessorImpl.java:25)
	at java.lang.reflect.Method.invoke(Method.java:597)
	at org.codehaus.classworlds.Launcher.launchEnhanced(Launcher.java:315)
	at org.codehaus.classworlds.Launcher.launch(Launcher.java:255)
	at org.codehaus.classworlds.Launcher.mainWithExitCode(Launcher.java:430)
	at org.codehaus.classworlds.Launcher.main(Launcher.java:375)
Caused by: org.apache.maven.plugin.CompilationFailureException: Compilation failure
	at org.apache.maven.plugin.AbstractCompilerMojo.execute(AbstractCompilerMojo.java:516)
	at org.apache.maven.plugin.CompilerMojo.execute(CompilerMojo.java:114)
	at org.apache.maven.plugin.DefaultPluginManager.executeMojo(DefaultPluginManager.java:483)
	at org.apache.maven.lifecycle.DefaultLifecycleExecutor.executeGoals(DefaultLifecycleExecutor.java:678)
	... 16 more
[INFO] ------------------------------------------------------------------------
[INFO] Total time: 14 seconds
[INFO] Finished at: Tue May 19 09:43:21 MDT 2009
[INFO] Final Memory: 28M/50M
[INFO] ------------------------------------------------------------------------