expected.html 98.4 KB
Newer Older
kdecker's avatar
kdecker committed
1 2 3 4 5 6 7 8 9
<html><head>
<title>Test results, kjs</title>
</head>
<body bgcolor='white'>
<a name='tippy_top'></a>
<h2>Test results, kjs</h2><br>
<p class='results_summary'>
Test List: All tests<br>
Skip List: ecma/Date<br>
10
967 test(s) selected, 962 test(s) completed, 99 failures reported (10.29% failed)<br>
ggaren's avatar
ggaren committed
11
Engine command line: /Users/ggaren/Development/symroots/Development/testkjs <br>
12
OS type: Darwin il0204a-dhcp30.apple.com 8.2.0 Darwin Kernel Version 8.2.0: Fri Jun  3 21:09:06 PDT 2005; root:xnu-792.2.3.obj~1/RELEASE_PPC Power Macintosh powerpc<br>
ggaren's avatar
ggaren committed
13 14
Testcase execution time: 1 minutes, 37 seconds.<br>
Tests completed on Fri Jul 22 17:32:06 2005.<br><br>
kdecker's avatar
kdecker committed
15 16 17 18
[ <a href='#fail_detail'>Failure Details</a> | <a href='#retest_list'>Retest List</a> | <a href='menu.html'>Test Selection Page</a> ]<br>
<hr>
<a name='fail_detail'></a>
<h2>Failure Details</h2><br>
19
<dl><a name='failure1'></a><dd><b>Testcase <a target='other_window' href='./ecma/GlobalObject/15.1.2.2-2.js'>ecma/GlobalObject/15.1.2.2-2.js</a> failed</b> <br>
kdecker's avatar
kdecker committed
20 21 22
 [ <a href='#failure2'>Next Failure</a> | <a href='#tippy_top'>Top of Page</a> ]<br>
<tt><br>
Failure messages were:<br>
darin's avatar
darin committed
23 24 25
--> parseInt("0000001000000001001000110100010101100111100010011010101111011",2) = 18054430506169720 FAILED! expected: 18054430506169724<br>
--> parseInt("123456789012345678") = 123456789012345700 FAILED! expected: 123456789012345680<br>
--> parseInt("0x1000000000000081") = 1152921504606847000 FAILED! expected: 1152921504606847200<br>
kdecker's avatar
kdecker committed
26 27 28 29
--> s = 0xFFFFFFFFFFFFF800000000000000000000000000000000000000000000000000000000000000000000000000000000000000000000000000000000000000000000000000000000000000000000000000000000000000000000000000000000000000000000000000000000000000000000000000000000000000000000000000; -s = -1.7976931348623155e+308 FAILED! expected: -1.7976931348623157e+308<br>
--> s = 0xFFFFFFFFFFFFF800000000000000000000000000000000000000000000000000000000000000000000000000000000000000000000000000000000000000000000000000000000000000000000000000000000000000000000000000000000000000000000000000000000000000000000000000000000000000000000000001; -s = -1.7976931348623155e+308 FAILED! expected: -1.7976931348623157e+308<br>
--> s = 0xFFFFFFFFFFFFFC00000000000000000000000000000000000000000000000000000000000000000000000000000000000000000000000000000000000000000000000000000000000000000000000000000000000000000000000000000000000000000000000000000000000000000000000000000000000000000000000000; -s = -1.7976931348623157e+308 FAILED! expected: -Infinity<br>
</tt><br>
30 31
<a name='failure2'></a><dd><b>Testcase <a target='other_window' href='./ecma/LexicalConventions/7.7.3-1.js'>ecma/LexicalConventions/7.7.3-1.js</a> failed</b> <br>
 [ <a href='#failure1'>Previous Failure</a> | <a href='#failure3'>Next Failure</a> | <a href='#tippy_top'>Top of Page</a> ]<br>
kdecker's avatar
kdecker committed
32 33
<tt><br>
Failure messages were:<br>
darin's avatar
darin committed
34 35 36
--> 0x1000000000000081 = 1152921504606847000 FAILED! expected: 1152921504606847200<br>
--> 0x1000000000000281 = 1152921504606847500 FAILED! expected: 1152921504606847700<br>
</tt><br>
37
<a name='failure3'></a><dd><b>Testcase <a target='other_window' href='./ecma/TypeConversion/9.3.1-3.js'>ecma/TypeConversion/9.3.1-3.js</a> failed</b> <br>
38
 [ <a href='#failure2'>Previous Failure</a> | <a href='#failure4'>Next Failure</a> | <a href='#tippy_top'>Top of Page</a> ]<br>
kdecker's avatar
kdecker committed
39 40 41 42 43 44 45 46
<tt><br>
Failure messages were:<br>
--> - "-0x123456789abcde8" = NaN FAILED! expected: 81985529216486880<br>
--> -"1e2000" = NaN FAILED! expected: -Infinity<br>
--> -"-1e2000" +'' = NaN FAILED! expected: Infinity<br>
--> parseFloat("1e2000") = NaN FAILED! expected: Infinity<br>
--> -s2 == -Infinity || -s2 == -1.7976931348623157e+308  = false FAILED! expected: true<br>
--> -s3 == -Infinity || -s3 == -1.7976931348623157e+308 = false FAILED! expected: true<br>
47 48 49 50
--> parseInt(s1,10) == 1.7976931348623157e+308 || parseInt(s1,10) == Infinity = false FAILED! expected: true<br>
--> parseInt(s2,10) == Infinity || parseInt(s2,10) == 1.7976931348623157e+308 = false FAILED! expected: true<br>
--> parseInt(s1) == 1.7976931348623157e+308 || parseInt(s1) == Infinity = false FAILED! expected: true<br>
--> parseInt(s2) == Infinity || parseInt(s2) == 1.7976931348623157e+308 = false FAILED! expected: true<br>
darin's avatar
darin committed
51 52
--> 0x1000000000000081 = 1152921504606847000 FAILED! expected: 1152921504606847200<br>
--> 0x1000000000000281 = 1152921504606847500 FAILED! expected: 1152921504606847700<br>
darin's avatar
darin committed
53 54 55
--> parseInt("0000001000000001001000110100010101100111100010011010101111011",2) = 18054430506169720 FAILED! expected: 18054430506169724<br>
--> parseInt("123456789012345678") = 123456789012345700 FAILED! expected: 123456789012345680<br>
--> parseInt("0x1000000000000081") = 1152921504606847000 FAILED! expected: 1152921504606847200<br>
kdecker's avatar
kdecker committed
56 57 58 59 60 61
--> -s = -1.7976931348623155e+308 FAILED! expected: -1.7976931348623157e+308<br>
--> -s = -1.7976931348623155e+308 FAILED! expected: -1.7976931348623157e+308<br>
--> -s = -1.7976931348623157e+308 FAILED! expected: -Infinity<br>
--> - "-0x123456789abcde8" = NaN FAILED! expected: 81985529216486880<br>
--> -"\u20001234\u2001" = NaN FAILED! expected: -1234<br>
</tt><br>
62 63
<a name='failure4'></a><dd><b>Testcase <a target='other_window' href='./ecma/TypeConversion/9.4-1.js'>ecma/TypeConversion/9.4-1.js</a> failed</b> <br>
 [ <a href='#failure3'>Previous Failure</a> | <a href='#failure5'>Next Failure</a> | <a href='#tippy_top'>Top of Page</a> ]<br>
kdecker's avatar
kdecker committed
64 65 66 67 68 69 70
<tt><br>
Failure messages were:<br>
--> td = new Date(true); td.valueOf() = NaN FAILED! expected: 1<br>
--> td = new Date(true); td.valueOf() = NaN FAILED! expected: 1<br>
--> td = new Date(false); td.valueOf() = NaN FAILED! expected: 0<br>
--> td = new Date(false); td.valueOf() = NaN FAILED! expected: 0<br>
</tt><br>
71 72
<a name='failure5'></a><dd><b>Testcase <a target='other_window' href='./ecma/TypeConversion/9.4-2.js'>ecma/TypeConversion/9.4-2.js</a> failed</b> <br>
 [ <a href='#failure4'>Previous Failure</a> | <a href='#failure6'>Next Failure</a> | <a href='#tippy_top'>Top of Page</a> ]<br>
kdecker's avatar
kdecker committed
73 74 75 76 77 78 79
<tt><br>
Failure messages were:<br>
--> td = new Date(true); td.valueOf() = NaN FAILED! expected: 1<br>
--> td = new Date(true); td.valueOf() = NaN FAILED! expected: 1<br>
--> td = new Date(false); td.valueOf() = NaN FAILED! expected: 0<br>
--> td = new Date(false); td.valueOf() = NaN FAILED! expected: 0<br>
</tt><br>
80 81
<a name='failure6'></a><dd><b>Testcase <a target='other_window' href='./ecma_2/Exceptions/function-001.js'>ecma_2/Exceptions/function-001.js</a> failed</b> <a href='http://bugzilla.mozilla.org/show_bug.cgi?id=10278' target='other_window'>Bug Number 10278</a><br>
 [ <a href='#failure5'>Previous Failure</a> | <a href='#failure7'>Next Failure</a> | <a href='#tippy_top'>Top of Page</a> ]<br>
kdecker's avatar
kdecker committed
82 83 84 85
<tt><br>
Failure messages were:<br>
--> eval("function f(){}function g(){}") (threw no exception thrown = fail FAILED! expected: pass<br>
</tt><br>
86 87
<a name='failure7'></a><dd><b>Testcase <a target='other_window' href='./ecma_2/RegExp/regress-001.js'>ecma_2/RegExp/regress-001.js</a> failed</b> <a href='http://bugzilla.mozilla.org/show_bug.cgi?id=http://bugzilla.mozilla.org/show_bug.cgi?id=2157' target='other_window'>Bug Number http://bugzilla.mozilla.org/show_bug.cgi?id=2157</a><br>
 [ <a href='#failure6'>Previous Failure</a> | <a href='#failure8'>Next Failure</a> | <a href='#tippy_top'>Top of Page</a> ]<br>
kdecker's avatar
kdecker committed
88 89 90 91 92
<tt>Expected exit code 0, got 3<br>
Testcase terminated with signal 0<br>
Complete testcase output was:<br>
--> RegExp/hex-001.js JS regexp anchoring on empty match bug<br>
--> BUGNUMBER: http://bugzilla.mozilla.org/show_bug.cgi?id=2157<br>
93
Exception, line 19: TypeError: Object /a||b/ (result of expression a||b) does not allow calls.<br>
kdecker's avatar
kdecker committed
94
</tt><br>
95 96
<a name='failure8'></a><dd><b>Testcase <a target='other_window' href='./ecma_2/RegExp/unicode-001.js'>ecma_2/RegExp/unicode-001.js</a> failed</b> <br>
 [ <a href='#failure7'>Previous Failure</a> | <a href='#failure9'>Next Failure</a> | <a href='#tippy_top'>Top of Page</a> ]<br>
kdecker's avatar
kdecker committed
97 98 99 100
<tt>Expected exit code 0, got 3<br>
Testcase terminated with signal 0<br>
Complete testcase output was:<br>
--> RegExp/unicode-001.js new RegExp( pattern, flags )<br>
101
Exception, line 34: TypeError: Null value<br>
kdecker's avatar
kdecker committed
102
</tt><br>
103
<a name='failure9'></a><dd><b>Testcase <a target='other_window' href='./ecma_3/Date/15.9.5.7.js'>ecma_3/Date/15.9.5.7.js</a> failed</b> <br>
104
 [ <a href='#failure8'>Previous Failure</a> | <a href='#failure10'>Next Failure</a> | <a href='#tippy_top'>Top of Page</a> ]<br>
kdecker's avatar
kdecker committed
105 106
<tt><br>
Failure messages were:<br>
107 108
--> (Wed Dec 31 1969 16:00:00 GMT-0800).toLocaleTimeString() = 4:00:00 PM PST FAILED! expected: 16:00:00<br>
--> (Wed Dec 31 1969 08:00:00 GMT-0800).toLocaleTimeString() = 8:00:00 AM PST FAILED! expected: 08:00:00<br>
ggaren's avatar
ggaren committed
109 110
--> (Sun Dec 31 1899 16:00:00 GMT-0800).toLocaleTimeString() = 5:00:00 PM PDT FAILED! expected: 16:00:00<br>
--> (Mon Jan 01 1900 00:00:00 GMT-0800).toLocaleTimeString() = 1:00:00 AM PDT FAILED! expected: 00:00:00<br>
111 112 113 114 115
--> (Fri Dec 31 1999 16:00:00 GMT-0800).toLocaleTimeString() = 4:00:00 PM PST FAILED! expected: 16:00:00<br>
--> (Sat Jan 01 2000 00:00:00 GMT-0800).toLocaleTimeString() = 12:00:00 AM PST FAILED! expected: 00:00:00<br>
--> (Mon Feb 28 2000 16:00:00 GMT-0800).toLocaleTimeString() = 4:00:00 PM PST FAILED! expected: 16:00:00<br>
--> (Mon Feb 28 2000 15:59:59 GMT-0800).toLocaleTimeString() = 3:59:59 PM PST FAILED! expected: 15:59:59<br>
--> (Tue Feb 29 2000 00:00:00 GMT-0800).toLocaleTimeString() = 12:00:00 AM PST FAILED! expected: 00:00:00<br>
ggaren's avatar
ggaren committed
116 117
--> (Fri Jul 22 2005 17:31:35 GMT-0700).toLocaleTimeString() = 5:31:35 PM PDT FAILED! expected: 17:31:35<br>
--> (Sat Jul 23 2005 01:31:35 GMT-0700).toLocaleTimeString() = 1:31:35 AM PDT FAILED! expected: 01:31:35<br>
118 119 120 121
--> (Fri Dec 31 2004 16:00:00 GMT-0800).toLocaleTimeString() = 4:00:00 PM PST FAILED! expected: 16:00:00<br>
--> (Fri Dec 31 2004 15:59:59 GMT-0800).toLocaleTimeString() = 3:59:59 PM PST FAILED! expected: 15:59:59<br>
--> (Sat Jan 01 2005 00:00:00 GMT-0800).toLocaleTimeString() = 12:00:00 AM PST FAILED! expected: 00:00:00<br>
</tt><br>
122 123
<a name='failure10'></a><dd><b>Testcase <a target='other_window' href='./ecma_3/Function/regress-193555.js'>ecma_3/Function/regress-193555.js</a> failed</b> <br>
 [ <a href='#failure9'>Previous Failure</a> | <a href='#failure11'>Next Failure</a> | <a href='#tippy_top'>Top of Page</a> ]<br>
kdecker's avatar
kdecker committed
124 125 126
<tt>Expected exit code 0, got 3<br>
Testcase terminated with signal 0<br>
Complete testcase output was:<br>
127
Exception, line 65: ReferenceError: Can't find variable: g<br>
kdecker's avatar
kdecker committed
128
</tt><br>
129 130
<a name='failure11'></a><dd><b>Testcase <a target='other_window' href='./ecma_3/Function/regress-58274.js'>ecma_3/Function/regress-58274.js</a> failed</b> <br>
 [ <a href='#failure10'>Previous Failure</a> | <a href='#failure12'>Next Failure</a> | <a href='#tippy_top'>Top of Page</a> ]<br>
kdecker's avatar
kdecker committed
131 132 133 134
<tt>Expected exit code 0, got 3<br>
Testcase terminated with signal 0<br>
Complete testcase output was:<br>
yylex: ERROR.<br>
135
Exception, line 83: SyntaxError: Parse error<br>
kdecker's avatar
kdecker committed
136
</tt><br>
137 138
<a name='failure12'></a><dd><b>Testcase <a target='other_window' href='./ecma_3/FunExpr/fe-001.js'>ecma_3/FunExpr/fe-001.js</a> failed</b> <br>
 [ <a href='#failure11'>Previous Failure</a> | <a href='#failure13'>Next Failure</a> | <a href='#tippy_top'>Top of Page</a> ]<br>
kdecker's avatar
kdecker committed
139 140 141
<tt>Expected exit code 0, got 3<br>
Testcase terminated with signal 0<br>
Complete testcase output was:<br>
142
Exception, line 26: SyntaxError: Parse error<br>
adele's avatar
adele committed
143
</tt><br>
144 145
<a name='failure13'></a><dd><b>Testcase <a target='other_window' href='./ecma_3/Object/class-002.js'>ecma_3/Object/class-002.js</a> failed</b> <a href='http://bugzilla.mozilla.org/show_bug.cgi?id=(none)' target='other_window'>Bug Number (none)</a><br>
 [ <a href='#failure12'>Previous Failure</a> | <a href='#failure14'>Next Failure</a> | <a href='#tippy_top'>Top of Page</a> ]<br>
kdecker's avatar
kdecker committed
146 147 148 149 150 151
<tt>--> STATUS: Testing the internal [[Class]] property of native constructors<br>
Failure messages were:<br>
--> FAILED!: [reported from test()] Current constructor is: Number<br>
--> FAILED!: [reported from test()] Expected value 'Function', Actual value 'Number'<br>
--> FAILED!: [reported from test()] <br>
</tt><br>
152 153
<a name='failure14'></a><dd><b>Testcase <a target='other_window' href='./ecma_3/RegExp/15.10.2-1.js'>ecma_3/RegExp/15.10.2-1.js</a> failed</b> <a href='http://bugzilla.mozilla.org/show_bug.cgi?id=(none)' target='other_window'>Bug Number (none)</a><br>
 [ <a href='#failure13'>Previous Failure</a> | <a href='#failure15'>Next Failure</a> | <a href='#tippy_top'>Top of Page</a> ]<br>
kdecker's avatar
kdecker committed
154 155 156 157 158 159 160 161 162 163 164 165 166 167 168 169 170 171 172 173 174 175 176 177
<tt>--> STATUS: RegExp conformance test<br>
Failure messages were:<br>
--> FAILED!: [reported from test()] Section 7 of test -<br>
--> FAILED!: [reported from test()] regexp = /(z)((a+)?(b+)?(c))*/<br>
--> FAILED!: [reported from test()] string = 'zaacbbbcac'<br>
--> FAILED!: [reported from test()] ERROR !!! regexp failed to give expected match array:<br>
--> FAILED!: [reported from test()] Expect: ["zaacbbbcac", "z", "ac", "a", , "c"]<br>
--> FAILED!: [reported from test()] Actual: ["zaacbbbcac", "z", "ac", "a", "bbb", "c"]<br>
--> FAILED!: [reported from test()] <br>
--> FAILED!: [reported from test()] Section 8 of test -<br>
--> FAILED!: [reported from test()] regexp = /(a*)*/<br>
--> FAILED!: [reported from test()] string = 'b'<br>
--> FAILED!: [reported from test()] ERROR !!! regexp failed to give expected match array:<br>
--> FAILED!: [reported from test()] Expect: ["", , ]<br>
--> FAILED!: [reported from test()] Actual: ["", ""]<br>
--> FAILED!: [reported from test()] <br>
--> FAILED!: [reported from test()] Section 12 of test -<br>
--> FAILED!: [reported from test()] regexp = /(.*?)a(?!(a+)b\2c)\2(.*)/<br>
--> FAILED!: [reported from test()] string = 'baaabaac'<br>
--> FAILED!: [reported from test()] ERROR !!! regexp FAILED to match anything !!!<br>
--> FAILED!: [reported from test()] Expect: ["baaabaac", "ba", , "abaac"]<br>
--> FAILED!: [reported from test()] Actual: null<br>
--> FAILED!: [reported from test()] <br>
</tt><br>
178 179
<a name='failure15'></a><dd><b>Testcase <a target='other_window' href='./ecma_3/RegExp/15.10.6.2-2.js'>ecma_3/RegExp/15.10.6.2-2.js</a> failed</b> <a href='http://bugzilla.mozilla.org/show_bug.cgi?id=76717' target='other_window'>Bug Number 76717</a><br>
 [ <a href='#failure14'>Previous Failure</a> | <a href='#failure16'>Next Failure</a> | <a href='#tippy_top'>Top of Page</a> ]<br>
kdecker's avatar
kdecker committed
180 181 182
<tt>--> STATUS: Testing re.exec(str) when re.lastIndex is < 0 or > str.length<br>
Failure messages were:<br>
--> FAILED!: [reported from test()] Section 6 of test -<br>
darin's avatar
darin committed
183
--> FAILED!: [reported from test()] regexp = /abc/gi<br>
kdecker's avatar
kdecker committed
184 185 186 187 188 189
--> FAILED!: [reported from test()] string = 'AbcaBcabC'<br>
--> FAILED!: [reported from test()] ERROR !!! regexp MATCHED when we expected it to fail !!!<br>
--> FAILED!: [reported from test()] Expect: null<br>
--> FAILED!: [reported from test()] Actual: ["Abc"]<br>
--> FAILED!: [reported from test()] <br>
--> FAILED!: [reported from test()] Section 7 of test -<br>
darin's avatar
darin committed
190
--> FAILED!: [reported from test()] regexp = /abc/gi<br>
kdecker's avatar
kdecker committed
191 192 193 194 195 196
--> FAILED!: [reported from test()] string = 'AbcaBcabC'<br>
--> FAILED!: [reported from test()] ERROR !!! regexp MATCHED when we expected it to fail !!!<br>
--> FAILED!: [reported from test()] Expect: null<br>
--> FAILED!: [reported from test()] Actual: ["Abc"]<br>
--> FAILED!: [reported from test()] <br>
--> FAILED!: [reported from test()] Section 8 of test -<br>
darin's avatar
darin committed
197
--> FAILED!: [reported from test()] regexp = /abc/gi<br>
kdecker's avatar
kdecker committed
198 199 200 201 202
--> FAILED!: [reported from test()] string = 'AbcaBcabC'<br>
--> FAILED!: [reported from test()] ERROR !!! regexp MATCHED when we expected it to fail !!!<br>
--> FAILED!: [reported from test()] Expect: null<br>
--> FAILED!: [reported from test()] Actual: ["aBc"]<br>
--> FAILED!: [reported from test()] <br>
darin's avatar
darin committed
203
--> FAILED!: [reported from test()] Section 10 of test -<br>
darin's avatar
darin committed
204
--> FAILED!: [reported from test()] regexp = /abc/gi<br>
kdecker's avatar
kdecker committed
205 206 207 208 209
--> FAILED!: [reported from test()] string = 'AbcaBcabC'<br>
--> FAILED!: [reported from test()] ERROR !!! regexp MATCHED when we expected it to fail !!!<br>
--> FAILED!: [reported from test()] Expect: null<br>
--> FAILED!: [reported from test()] Actual: ["Abc"]<br>
--> FAILED!: [reported from test()] <br>
darin's avatar
darin committed
210
--> FAILED!: [reported from test()] Section 11 of test -<br>
darin's avatar
darin committed
211
--> FAILED!: [reported from test()] regexp = /abc/gi<br>
kdecker's avatar
kdecker committed
212 213 214 215 216 217
--> FAILED!: [reported from test()] string = 'AbcaBcabC'<br>
--> FAILED!: [reported from test()] ERROR !!! regexp MATCHED when we expected it to fail !!!<br>
--> FAILED!: [reported from test()] Expect: null<br>
--> FAILED!: [reported from test()] Actual: ["Abc"]<br>
--> FAILED!: [reported from test()] <br>
--> FAILED!: [reported from test()] Section 12 of test -<br>
darin's avatar
darin committed
218
--> FAILED!: [reported from test()] regexp = /abc/gi<br>
kdecker's avatar
kdecker committed
219 220 221 222 223 224
--> FAILED!: [reported from test()] string = 'AbcaBcabC'<br>
--> FAILED!: [reported from test()] ERROR !!! regexp MATCHED when we expected it to fail !!!<br>
--> FAILED!: [reported from test()] Expect: null<br>
--> FAILED!: [reported from test()] Actual: ["Abc"]<br>
--> FAILED!: [reported from test()] <br>
--> FAILED!: [reported from test()] Section 13 of test -<br>
darin's avatar
darin committed
225
--> FAILED!: [reported from test()] regexp = /abc/gi<br>
kdecker's avatar
kdecker committed
226 227 228 229 230 231
--> FAILED!: [reported from test()] string = 'AbcaBcabC'<br>
--> FAILED!: [reported from test()] ERROR !!! regexp MATCHED when we expected it to fail !!!<br>
--> FAILED!: [reported from test()] Expect: null<br>
--> FAILED!: [reported from test()] Actual: ["Abc"]<br>
--> FAILED!: [reported from test()] <br>
--> FAILED!: [reported from test()] Section 14 of test -<br>
darin's avatar
darin committed
232
--> FAILED!: [reported from test()] regexp = /abc/gi<br>
kdecker's avatar
kdecker committed
233 234 235 236 237 238
--> FAILED!: [reported from test()] string = 'AbcaBcabC'<br>
--> FAILED!: [reported from test()] ERROR !!! regexp MATCHED when we expected it to fail !!!<br>
--> FAILED!: [reported from test()] Expect: null<br>
--> FAILED!: [reported from test()] Actual: ["Abc"]<br>
--> FAILED!: [reported from test()] <br>
--> FAILED!: [reported from test()] Section 15 of test -<br>
darin's avatar
darin committed
239
--> FAILED!: [reported from test()] regexp = /abc/gi<br>
kdecker's avatar
kdecker committed
240 241 242 243 244 245
--> FAILED!: [reported from test()] string = 'AbcaBcabC'<br>
--> FAILED!: [reported from test()] ERROR !!! regexp MATCHED when we expected it to fail !!!<br>
--> FAILED!: [reported from test()] Expect: null<br>
--> FAILED!: [reported from test()] Actual: ["Abc"]<br>
--> FAILED!: [reported from test()] <br>
</tt><br>
246 247
<a name='failure16'></a><dd><b>Testcase <a target='other_window' href='./ecma_3/RegExp/octal-002.js'>ecma_3/RegExp/octal-002.js</a> failed</b> <a href='http://bugzilla.mozilla.org/show_bug.cgi?id=141078' target='other_window'>Bug Number 141078</a><br>
 [ <a href='#failure15'>Previous Failure</a> | <a href='#failure17'>Next Failure</a> | <a href='#tippy_top'>Top of Page</a> ]<br>
248 249 250 251 252 253 254 255 256 257
<tt>--> STATUS: Testing regexps containing octal escape sequences<br>
Failure messages were:<br>
--> FAILED!: [reported from test()] Section 8 of test -<br>
--> FAILED!: [reported from test()] regexp = /a<br>
--> FAILED!: [reported from test()] string = 'a<br>
--> FAILED!: [reported from test()] ERROR !!! regexp failed to give expected match array:<br>
--> FAILED!: [reported from test()] Expect: ["a<br>
--> FAILED!: [reported from test()] Actual: ["a"]<br>
--> FAILED!: [reported from test()] <br>
</tt><br>
258 259
<a name='failure17'></a><dd><b>Testcase <a target='other_window' href='./ecma_3/RegExp/perlstress-001.js'>ecma_3/RegExp/perlstress-001.js</a> failed</b> <a href='http://bugzilla.mozilla.org/show_bug.cgi?id=85721' target='other_window'>Bug Number 85721</a><br>
 [ <a href='#failure16'>Previous Failure</a> | <a href='#failure18'>Next Failure</a> | <a href='#tippy_top'>Top of Page</a> ]<br>
kdecker's avatar
kdecker committed
260 261 262 263 264 265 266 267 268 269 270 271 272 273 274 275 276 277 278 279 280 281 282
<tt>--> STATUS: Testing regular expression edge cases<br>
Failure messages were:<br>
--> FAILED!: [reported from test()] Section 218 of test -<br>
--> FAILED!: [reported from test()] regexp = /((foo)|(bar))*/<br>
--> FAILED!: [reported from test()] string = 'foobar'<br>
--> FAILED!: [reported from test()] ERROR !!! regexp failed to give expected match array:<br>
--> FAILED!: [reported from test()] Expect: ["foobar", "bar", , "bar"]<br>
--> FAILED!: [reported from test()] Actual: ["foobar", "bar", "foo", "bar"]<br>
--> FAILED!: [reported from test()] <br>
--> FAILED!: [reported from test()] Section 234 of test -<br>
--> FAILED!: [reported from test()] regexp = /(?:(f)(o)(o)|(b)(a)(r))*/<br>
--> FAILED!: [reported from test()] string = 'foobar'<br>
--> FAILED!: [reported from test()] ERROR !!! regexp failed to give expected match array:<br>
--> FAILED!: [reported from test()] Expect: ["foobar", , , , "b", "a", "r"]<br>
--> FAILED!: [reported from test()] Actual: ["foobar", "f", "o", "o", "b", "a", "r"]<br>
--> FAILED!: [reported from test()] <br>
--> FAILED!: [reported from test()] Section 241 of test -<br>
--> FAILED!: [reported from test()] regexp = /^(?:b|a(?=(.)))*\1/<br>
--> FAILED!: [reported from test()] string = 'abc'<br>
--> FAILED!: [reported from test()] ERROR !!! regexp failed to give expected match array:<br>
--> FAILED!: [reported from test()] Expect: ["ab", , ]<br>
--> FAILED!: [reported from test()] Actual: ["ab", "b"]<br>
--> FAILED!: [reported from test()] <br>
darin's avatar
darin committed
283 284 285 286 287 288 289 290 291 292 293 294 295 296 297 298 299 300 301 302 303
--> FAILED!: [reported from test()] Section 402 of test -<br>
--> FAILED!: [reported from test()] regexp = /^([^,]{1,3},){3}d/i<br>
--> FAILED!: [reported from test()] string = 'aaa,b,c,d'<br>
--> FAILED!: [reported from test()] ERROR !!! regexp FAILED to match anything !!!<br>
--> FAILED!: [reported from test()] Expect: ["aaa,b,c,d", "c,"]<br>
--> FAILED!: [reported from test()] Actual: null<br>
--> FAILED!: [reported from test()] <br>
--> FAILED!: [reported from test()] Section 403 of test -<br>
--> FAILED!: [reported from test()] regexp = /^([^,]{1,3},){3,}d/<br>
--> FAILED!: [reported from test()] string = 'aaa,b,c,d'<br>
--> FAILED!: [reported from test()] ERROR !!! regexp FAILED to match anything !!!<br>
--> FAILED!: [reported from test()] Expect: ["aaa,b,c,d", "c,"]<br>
--> FAILED!: [reported from test()] Actual: null<br>
--> FAILED!: [reported from test()] <br>
--> FAILED!: [reported from test()] Section 404 of test -<br>
--> FAILED!: [reported from test()] regexp = /^([^,]{1,3},){0,3}d/<br>
--> FAILED!: [reported from test()] string = 'aaa,b,c,d'<br>
--> FAILED!: [reported from test()] ERROR !!! regexp FAILED to match anything !!!<br>
--> FAILED!: [reported from test()] Expect: ["aaa,b,c,d", "c,"]<br>
--> FAILED!: [reported from test()] Actual: null<br>
--> FAILED!: [reported from test()] <br>
kdecker's avatar
kdecker committed
304 305 306 307 308 309 310 311 312 313 314 315 316 317 318
--> FAILED!: [reported from test()] Section 412 of test -<br>
--> FAILED!: [reported from test()] regexp = /^(a(b)?)+$/<br>
--> FAILED!: [reported from test()] string = 'aba'<br>
--> FAILED!: [reported from test()] ERROR !!! regexp failed to give expected match array:<br>
--> FAILED!: [reported from test()] Expect: ["aba", "a", , ]<br>
--> FAILED!: [reported from test()] Actual: ["aba", "a", "b"]<br>
--> FAILED!: [reported from test()] <br>
--> FAILED!: [reported from test()] Section 413 of test -<br>
--> FAILED!: [reported from test()] regexp = /^(aa(bb)?)+$/<br>
--> FAILED!: [reported from test()] string = 'aabbaa'<br>
--> FAILED!: [reported from test()] ERROR !!! regexp failed to give expected match array:<br>
--> FAILED!: [reported from test()] Expect: ["aabbaa", "aa", , ]<br>
--> FAILED!: [reported from test()] Actual: ["aabbaa", "aa", "bb"]<br>
--> FAILED!: [reported from test()] <br>
</tt><br>
319 320
<a name='failure18'></a><dd><b>Testcase <a target='other_window' href='./ecma_3/RegExp/perlstress-002.js'>ecma_3/RegExp/perlstress-002.js</a> failed</b> <a href='http://bugzilla.mozilla.org/show_bug.cgi?id=85721' target='other_window'>Bug Number 85721</a><br>
 [ <a href='#failure17'>Previous Failure</a> | <a href='#failure19'>Next Failure</a> | <a href='#tippy_top'>Top of Page</a> ]<br>
kdecker's avatar
kdecker committed
321 322 323 324 325 326 327 328 329 330 331 332 333 334 335 336 337
<tt>--> STATUS: Testing regular expression edge cases<br>
Failure messages were:<br>
--> FAILED!: [reported from test()] Section 40 of test -<br>
--> FAILED!: [reported from test()] regexp = /(a)|\1/<br>
--> FAILED!: [reported from test()] string = 'x'<br>
--> FAILED!: [reported from test()] ERROR !!! regexp FAILED to match anything !!!<br>
--> FAILED!: [reported from test()] Expect: ["", , ]<br>
--> FAILED!: [reported from test()] Actual: null<br>
--> FAILED!: [reported from test()] <br>
--> FAILED!: [reported from test()] Section 41 of test -<br>
--> FAILED!: [reported from test()] regexp = /((\3|b)\2(a)x)+/<br>
--> FAILED!: [reported from test()] string = 'aaxabxbaxbbx'<br>
--> FAILED!: [reported from test()] ERROR !!! regexp FAILED to match anything !!!<br>
--> FAILED!: [reported from test()] Expect: ["ax", "ax", "", "a"]<br>
--> FAILED!: [reported from test()] Actual: null<br>
--> FAILED!: [reported from test()] <br>
</tt><br>
338 339
<a name='failure19'></a><dd><b>Testcase <a target='other_window' href='./ecma_3/RegExp/regress-100199.js'>ecma_3/RegExp/regress-100199.js</a> failed</b> <a href='http://bugzilla.mozilla.org/show_bug.cgi?id=100199' target='other_window'>Bug Number 100199</a><br>
 [ <a href='#failure18'>Previous Failure</a> | <a href='#failure20'>Next Failure</a> | <a href='#tippy_top'>Top of Page</a> ]<br>
kdecker's avatar
kdecker committed
340 341 342 343 344 345 346 347 348 349 350 351 352 353 354 355 356 357 358 359 360 361 362 363 364 365 366 367 368 369 370 371 372 373 374 375 376 377 378 379 380 381 382 383 384 385 386 387 388 389 390 391 392 393 394 395 396 397 398 399 400 401 402 403 404 405 406 407 408 409 410 411 412 413 414 415 416 417 418 419 420 421 422 423 424 425 426 427 428 429 430 431 432 433 434 435 436 437 438 439 440
<tt>--> STATUS: [], [^] are valid RegExp conditions. Should not cause errors -<br>
Failure messages were:<br>
--> FAILED!: [reported from test()] Section 19 of test -<br>
--> FAILED!: [reported from test()] regexp = /[^]/<br>
--> FAILED!: [reported from test()] string = 'abc'<br>
--> FAILED!: [reported from test()] ERROR !!! regexp FAILED to match anything !!!<br>
--> FAILED!: [reported from test()] Expect: ["a"]<br>
--> FAILED!: [reported from test()] Actual: null<br>
--> FAILED!: [reported from test()] <br>
--> FAILED!: [reported from test()] Section 21 of test -<br>
--> FAILED!: [reported from test()] regexp = /[^]/<br>
--> FAILED!: [reported from test()] string = '/'<br>
--> FAILED!: [reported from test()] ERROR !!! regexp FAILED to match anything !!!<br>
--> FAILED!: [reported from test()] Expect: ["/"]<br>
--> FAILED!: [reported from test()] Actual: null<br>
--> FAILED!: [reported from test()] <br>
--> FAILED!: [reported from test()] Section 22 of test -<br>
--> FAILED!: [reported from test()] regexp = /[^]/<br>
--> FAILED!: [reported from test()] string = '['<br>
--> FAILED!: [reported from test()] ERROR !!! regexp FAILED to match anything !!!<br>
--> FAILED!: [reported from test()] Expect: ["["]<br>
--> FAILED!: [reported from test()] Actual: null<br>
--> FAILED!: [reported from test()] <br>
--> FAILED!: [reported from test()] Section 23 of test -<br>
--> FAILED!: [reported from test()] regexp = /[^]/<br>
--> FAILED!: [reported from test()] string = '['<br>
--> FAILED!: [reported from test()] ERROR !!! regexp FAILED to match anything !!!<br>
--> FAILED!: [reported from test()] Expect: ["["]<br>
--> FAILED!: [reported from test()] Actual: null<br>
--> FAILED!: [reported from test()] <br>
--> FAILED!: [reported from test()] Section 24 of test -<br>
--> FAILED!: [reported from test()] regexp = /[^]/<br>
--> FAILED!: [reported from test()] string = ']'<br>
--> FAILED!: [reported from test()] ERROR !!! regexp FAILED to match anything !!!<br>
--> FAILED!: [reported from test()] Expect: ["]"]<br>
--> FAILED!: [reported from test()] Actual: null<br>
--> FAILED!: [reported from test()] <br>
--> FAILED!: [reported from test()] Section 25 of test -<br>
--> FAILED!: [reported from test()] regexp = /[^]/<br>
--> FAILED!: [reported from test()] string = '[]'<br>
--> FAILED!: [reported from test()] ERROR !!! regexp FAILED to match anything !!!<br>
--> FAILED!: [reported from test()] Expect: ["["]<br>
--> FAILED!: [reported from test()] Actual: null<br>
--> FAILED!: [reported from test()] <br>
--> FAILED!: [reported from test()] Section 26 of test -<br>
--> FAILED!: [reported from test()] regexp = /[^]/<br>
--> FAILED!: [reported from test()] string = '[ ]'<br>
--> FAILED!: [reported from test()] ERROR !!! regexp FAILED to match anything !!!<br>
--> FAILED!: [reported from test()] Expect: ["["]<br>
--> FAILED!: [reported from test()] Actual: null<br>
--> FAILED!: [reported from test()] <br>
--> FAILED!: [reported from test()] Section 27 of test -<br>
--> FAILED!: [reported from test()] regexp = /[^]/<br>
--> FAILED!: [reported from test()] string = ']['<br>
--> FAILED!: [reported from test()] ERROR !!! regexp FAILED to match anything !!!<br>
--> FAILED!: [reported from test()] Expect: ["]"]<br>
--> FAILED!: [reported from test()] Actual: null<br>
--> FAILED!: [reported from test()] <br>
--> FAILED!: [reported from test()] Section 28 of test -<br>
--> FAILED!: [reported from test()] regexp = /a[^]/<br>
--> FAILED!: [reported from test()] string = 'abc'<br>
--> FAILED!: [reported from test()] ERROR !!! regexp FAILED to match anything !!!<br>
--> FAILED!: [reported from test()] Expect: ["ab"]<br>
--> FAILED!: [reported from test()] Actual: null<br>
--> FAILED!: [reported from test()] <br>
--> FAILED!: [reported from test()] Section 30 of test -<br>
--> FAILED!: [reported from test()] regexp = /a[^]/<br>
--> FAILED!: [reported from test()] string = 'a['<br>
--> FAILED!: [reported from test()] ERROR !!! regexp FAILED to match anything !!!<br>
--> FAILED!: [reported from test()] Expect: ["a["]<br>
--> FAILED!: [reported from test()] Actual: null<br>
--> FAILED!: [reported from test()] <br>
--> FAILED!: [reported from test()] Section 31 of test -<br>
--> FAILED!: [reported from test()] regexp = /a[^]/<br>
--> FAILED!: [reported from test()] string = 'a]'<br>
--> FAILED!: [reported from test()] ERROR !!! regexp FAILED to match anything !!!<br>
--> FAILED!: [reported from test()] Expect: ["a]"]<br>
--> FAILED!: [reported from test()] Actual: null<br>
--> FAILED!: [reported from test()] <br>
--> FAILED!: [reported from test()] Section 32 of test -<br>
--> FAILED!: [reported from test()] regexp = /a[^]/<br>
--> FAILED!: [reported from test()] string = 'a[]'<br>
--> FAILED!: [reported from test()] ERROR !!! regexp FAILED to match anything !!!<br>
--> FAILED!: [reported from test()] Expect: ["a["]<br>
--> FAILED!: [reported from test()] Actual: null<br>
--> FAILED!: [reported from test()] <br>
--> FAILED!: [reported from test()] Section 33 of test -<br>
--> FAILED!: [reported from test()] regexp = /a[^]/<br>
--> FAILED!: [reported from test()] string = 'a[ ]'<br>
--> FAILED!: [reported from test()] ERROR !!! regexp FAILED to match anything !!!<br>
--> FAILED!: [reported from test()] Expect: ["a["]<br>
--> FAILED!: [reported from test()] Actual: null<br>
--> FAILED!: [reported from test()] <br>
--> FAILED!: [reported from test()] Section 34 of test -<br>
--> FAILED!: [reported from test()] regexp = /a[^]/<br>
--> FAILED!: [reported from test()] string = 'a]['<br>
--> FAILED!: [reported from test()] ERROR !!! regexp FAILED to match anything !!!<br>
--> FAILED!: [reported from test()] Expect: ["a]"]<br>
--> FAILED!: [reported from test()] Actual: null<br>
--> FAILED!: [reported from test()] <br>
</tt><br>
441 442
<a name='failure20'></a><dd><b>Testcase <a target='other_window' href='./ecma_3/RegExp/regress-188206.js'>ecma_3/RegExp/regress-188206.js</a> failed</b> <a href='http://bugzilla.mozilla.org/show_bug.cgi?id=188206' target='other_window'>Bug Number 188206</a><br>
 [ <a href='#failure19'>Previous Failure</a> | <a href='#failure21'>Next Failure</a> | <a href='#tippy_top'>Top of Page</a> ]<br>
kdecker's avatar
kdecker committed
443 444 445 446 447 448 449 450 451 452 453 454 455 456 457 458 459 460 461 462 463 464 465 466 467 468 469 470 471 472 473 474 475 476 477 478 479 480 481 482 483 484 485 486 487 488 489 490 491 492 493 494 495 496 497 498 499 500 501 502
<tt>--> STATUS: Invalid use of regexp quantifiers should generate SyntaxErrors<br>
Failure messages were:<br>
--> FAILED!: [reported from test()] Section 1 of test -<br>
--> FAILED!: [reported from test()] Expected value 'SyntaxError', Actual value 'Did not generate ANY error!!!'<br>
--> FAILED!: [reported from test()] <br>
--> FAILED!: [reported from test()] Section 2 of test -<br>
--> FAILED!: [reported from test()] Expected value 'SyntaxError', Actual value 'Did not generate ANY error!!!'<br>
--> FAILED!: [reported from test()] <br>
--> FAILED!: [reported from test()] Section 3 of test -<br>
--> FAILED!: [reported from test()] Expected value 'SyntaxError', Actual value 'Did not generate ANY error!!!'<br>
--> FAILED!: [reported from test()] <br>
--> FAILED!: [reported from test()] Section 4 of test -<br>
--> FAILED!: [reported from test()] Expected value 'SyntaxError', Actual value 'Did not generate ANY error!!!'<br>
--> FAILED!: [reported from test()] <br>
--> FAILED!: [reported from test()] Section 5 of test -<br>
--> FAILED!: [reported from test()] Expected value 'SyntaxError', Actual value 'Did not generate ANY error!!!'<br>
--> FAILED!: [reported from test()] <br>
--> FAILED!: [reported from test()] Section 6 of test -<br>
--> FAILED!: [reported from test()] Expected value 'SyntaxError', Actual value 'Did not generate ANY error!!!'<br>
--> FAILED!: [reported from test()] <br>
--> FAILED!: [reported from test()] Section 9 of test -<br>
--> FAILED!: [reported from test()] Expected value 'SyntaxError', Actual value 'Did not generate ANY error!!!'<br>
--> FAILED!: [reported from test()] <br>
--> FAILED!: [reported from test()] Section 10 of test -<br>
--> FAILED!: [reported from test()] Expected value 'SyntaxError', Actual value 'Did not generate ANY error!!!'<br>
--> FAILED!: [reported from test()] <br>
--> FAILED!: [reported from test()] Section 11 of test -<br>
--> FAILED!: [reported from test()] Expected value 'SyntaxError', Actual value 'Did not generate ANY error!!!'<br>
--> FAILED!: [reported from test()] <br>
--> FAILED!: [reported from test()] Section 12 of test -<br>
--> FAILED!: [reported from test()] Expected value 'SyntaxError', Actual value 'Did not generate ANY error!!!'<br>
--> FAILED!: [reported from test()] <br>
--> FAILED!: [reported from test()] Section 28 of test -<br>
--> FAILED!: [reported from test()] Expected value 'SyntaxError', Actual value 'Did not generate ANY error!!!'<br>
--> FAILED!: [reported from test()] <br>
--> FAILED!: [reported from test()] Section 29 of test -<br>
--> FAILED!: [reported from test()] Expected value 'SyntaxError', Actual value 'Did not generate ANY error!!!'<br>
--> FAILED!: [reported from test()] <br>
--> FAILED!: [reported from test()] Section 30 of test -<br>
--> FAILED!: [reported from test()] Expected value 'SyntaxError', Actual value 'Did not generate ANY error!!!'<br>
--> FAILED!: [reported from test()] <br>
--> FAILED!: [reported from test()] Section 31 of test -<br>
--> FAILED!: [reported from test()] Expected value 'SyntaxError', Actual value 'Did not generate ANY error!!!'<br>
--> FAILED!: [reported from test()] <br>
--> FAILED!: [reported from test()] Section 32 of test -<br>
--> FAILED!: [reported from test()] Expected value 'SyntaxError', Actual value 'Did not generate ANY error!!!'<br>
--> FAILED!: [reported from test()] <br>
--> FAILED!: [reported from test()] Section 33 of test -<br>
--> FAILED!: [reported from test()] Expected value 'SyntaxError', Actual value 'Did not generate ANY error!!!'<br>
--> FAILED!: [reported from test()] <br>
--> FAILED!: [reported from test()] Section 34 of test -<br>
--> FAILED!: [reported from test()] Expected value 'SyntaxError', Actual value 'Did not generate ANY error!!!'<br>
--> FAILED!: [reported from test()] <br>
--> FAILED!: [reported from test()] Section 35 of test -<br>
--> FAILED!: [reported from test()] Expected value 'SyntaxError', Actual value 'Did not generate ANY error!!!'<br>
--> FAILED!: [reported from test()] <br>
--> FAILED!: [reported from test()] Section 36 of test -<br>
--> FAILED!: [reported from test()] Expected value 'SyntaxError', Actual value 'Did not generate ANY error!!!'<br>
--> FAILED!: [reported from test()] <br>
</tt><br>
503 504
<a name='failure21'></a><dd><b>Testcase <a target='other_window' href='./ecma_3/RegExp/regress-209919.js'>ecma_3/RegExp/regress-209919.js</a> failed</b> <a href='http://bugzilla.mozilla.org/show_bug.cgi?id=209919' target='other_window'>Bug Number 209919</a><br>
 [ <a href='#failure20'>Previous Failure</a> | <a href='#failure22'>Next Failure</a> | <a href='#tippy_top'>Top of Page</a> ]<br>
kdecker's avatar
kdecker committed
505 506 507 508 509 510 511 512 513 514 515 516 517 518 519 520 521 522 523 524 525
<tt>--> STATUS: Testing regexp submatches with quantifiers<br>
Failure messages were:<br>
--> FAILED!: [reported from test()] Section 1 of test -<br>
--> FAILED!: [reported from test()] regexp = /(a|b*)*/<br>
--> FAILED!: [reported from test()] string = 'a'<br>
--> FAILED!: [reported from test()] ERROR !!! regexp failed to give expected match array:<br>
--> FAILED!: [reported from test()] Expect: ["a", "a"]<br>
--> FAILED!: [reported from test()] Actual: ["a", ""]<br>
--> FAILED!: [reported from test()] <br>
--> FAILED!: [reported from test()] Section 3 of test -<br>
--> FAILED!: [reported from test()] regexp = /(b*)*/<br>
--> FAILED!: [reported from test()] string = 'a'<br>
--> FAILED!: [reported from test()] ERROR !!! regexp failed to give expected match array:<br>
--> FAILED!: [reported from test()] Expect: ["", , ]<br>
--> FAILED!: [reported from test()] Actual: ["", ""]<br>
--> FAILED!: [reported from test()] <br>
--> FAILED!: [reported from test()] Section 5 of test -<br>
--> FAILED!: [reported from test()] regexp = /^\-?(\d{1,}|\.{0,})*(\,\d{1,})?$/<br>
--> FAILED!: [reported from test()] string = '100.00'<br>
--> FAILED!: [reported from test()] ERROR !!! regexp failed to give expected match array:<br>
--> FAILED!: [reported from test()] Expect: ["100.00", "00", , ]<br>
darin's avatar
darin committed
526
--> FAILED!: [reported from test()] Actual: ["100.00", "", , ]<br>
kdecker's avatar
kdecker committed
527 528 529 530 531 532 533 534 535 536 537 538 539 540 541 542
--> FAILED!: [reported from test()] <br>
--> FAILED!: [reported from test()] Section 6 of test -<br>
--> FAILED!: [reported from test()] regexp = /^\-?(\d{1,}|\.{0,})*(\,\d{1,})?$/<br>
--> FAILED!: [reported from test()] string = '100,00'<br>
--> FAILED!: [reported from test()] ERROR !!! regexp failed to give expected match array:<br>
--> FAILED!: [reported from test()] Expect: ["100,00", "100", ",00"]<br>
--> FAILED!: [reported from test()] Actual: ["100,00", "", ",00"]<br>
--> FAILED!: [reported from test()] <br>
--> FAILED!: [reported from test()] Section 7 of test -<br>
--> FAILED!: [reported from test()] regexp = /^\-?(\d{1,}|\.{0,})*(\,\d{1,})?$/<br>
--> FAILED!: [reported from test()] string = '1.000,00'<br>
--> FAILED!: [reported from test()] ERROR !!! regexp failed to give expected match array:<br>
--> FAILED!: [reported from test()] Expect: ["1.000,00", "000", ",00"]<br>
--> FAILED!: [reported from test()] Actual: ["1.000,00", "", ",00"]<br>
--> FAILED!: [reported from test()] <br>
</tt><br>
543 544
<a name='failure22'></a><dd><b>Testcase <a target='other_window' href='./ecma_3/RegExp/regress-72964.js'>ecma_3/RegExp/regress-72964.js</a> failed</b> <a href='http://bugzilla.mozilla.org/show_bug.cgi?id=72964' target='other_window'>Bug Number 72964</a><br>
 [ <a href='#failure21'>Previous Failure</a> | <a href='#failure23'>Next Failure</a> | <a href='#tippy_top'>Top of Page</a> ]<br>
kdecker's avatar
kdecker committed
545 546 547 548 549
<tt>--> STATUS: Testing regular expressions containing non-Latin1 characters<br>
Failure messages were:<br>
--> FAILED!: [reported from test()] Section 3 of test -<br>
--> FAILED!: [reported from test()] regexp = /[\S]+/<br>
--> FAILED!: [reported from test()] string = '<br>
darin's avatar
darin committed
550
--> FAILED!: [reported from test()] ERROR !!! regexp FAILED to match anything !!!<br>
kdecker's avatar
kdecker committed
551
--> FAILED!: [reported from test()] Expect: ["<br>
darin's avatar
darin committed
552
--> FAILED!: [reported from test()] Actual: null<br>
kdecker's avatar
kdecker committed
553 554 555 556
--> FAILED!: [reported from test()] <br>
--> FAILED!: [reported from test()] Section 4 of test -<br>
--> FAILED!: [reported from test()] regexp = /[\S]+/<br>
--> FAILED!: [reported from test()] string = '<br>
darin's avatar
darin committed
557
--> FAILED!: [reported from test()] ERROR !!! regexp FAILED to match anything !!!<br>
kdecker's avatar
kdecker committed
558
--> FAILED!: [reported from test()] Expect: ["<br>
darin's avatar
darin committed
559
--> FAILED!: [reported from test()] Actual: null<br>
kdecker's avatar
kdecker committed
560 561
--> FAILED!: [reported from test()] <br>
</tt><br>
562 563
<a name='failure23'></a><dd><b>Testcase <a target='other_window' href='./ecma_3/RegExp/regress-78156.js'>ecma_3/RegExp/regress-78156.js</a> failed</b> <a href='http://bugzilla.mozilla.org/show_bug.cgi?id=78156' target='other_window'>Bug Number 78156</a><br>
 [ <a href='#failure22'>Previous Failure</a> | <a href='#failure24'>Next Failure</a> | <a href='#tippy_top'>Top of Page</a> ]<br>
kdecker's avatar
kdecker committed
564 565 566
<tt>--> STATUS: Testing regular expressions with  ^, $, and the m flag -<br>
Failure messages were:<br>
--> FAILED!: [reported from test()] Section 2 of test -<br>
darin's avatar
darin committed
567
--> FAILED!: [reported from test()] regexp = /\d$/gm<br>
kdecker's avatar
kdecker committed
568 569 570 571 572 573
--> FAILED!: [reported from test()] string = 'aaa\n789\r\nccc\r\n345'<br>
--> FAILED!: [reported from test()] ERROR !!! match arrays have different lengths:<br>
--> FAILED!: [reported from test()] Expect: ["9", "5"]<br>
--> FAILED!: [reported from test()] Actual: ["5"]<br>
--> FAILED!: [reported from test()] <br>
--> FAILED!: [reported from test()] Section 4 of test -<br>
darin's avatar
darin committed
574
--> FAILED!: [reported from test()] regexp = /\d$/gm<br>
kdecker's avatar
kdecker committed
575 576 577 578 579 580
--> FAILED!: [reported from test()] string = 'aaa\n789\r\nccc\r\nddd'<br>
--> FAILED!: [reported from test()] ERROR !!! regexp FAILED to match anything !!!<br>
--> FAILED!: [reported from test()] Expect: ["9"]<br>
--> FAILED!: [reported from test()] Actual: null<br>
--> FAILED!: [reported from test()] <br>
</tt><br>
581 582
<a name='failure24'></a><dd><b>Testcase <a target='other_window' href='./ecma_3/RegExp/regress-85721.js'>ecma_3/RegExp/regress-85721.js</a> failed</b> <a href='http://bugzilla.mozilla.org/show_bug.cgi?id=85721' target='other_window'>Bug Number 85721</a><br>
 [ <a href='#failure23'>Previous Failure</a> | <a href='#failure25'>Next Failure</a> | <a href='#tippy_top'>Top of Page</a> ]<br>
kdecker's avatar
kdecker committed
583 584 585 586 587 588 589 590 591 592 593 594 595 596 597 598 599 600 601 602 603 604 605 606 607 608 609 610 611 612 613 614 615 616 617 618 619 620 621 622 623 624 625 626 627 628 629 630 631 632 633 634 635 636 637 638 639 640 641 642 643 644 645 646 647 648 649 650 651 652 653 654 655 656 657 658 659 660 661 662 663 664 665 666 667 668 669 670 671 672 673 674 675 676 677 678 679 680 681 682 683 684 685 686 687 688 689 690 691 692 693 694 695 696 697 698 699 700 701 702 703 704 705 706 707 708 709 710 711 712 713 714 715 716 717 718 719 720 721 722 723 724 725 726 727 728 729 730 731 732 733 734 735 736 737 738 739 740 741 742 743 744 745 746 747 748 749 750 751 752 753 754 755 756 757 758 759 760 761 762 763 764 765 766 767 768 769 770 771 772 773 774 775 776 777 778 779 780 781 782 783 784 785 786 787 788 789 790 791 792 793 794 795 796 797 798 799 800 801 802 803
<tt>--> STATUS: Performance: execution of regular expression<br>
Failure messages were:<br>
--> FAILED!: Section 4 of test -<br>
--> FAILED!: regexp = /[ 	]*(?:\([^\\-<br>
--> FAILED!: 
()]*(?:(?:\\[^-]|\([^\\-<br>
--> FAILED!: 
()]*(?:\\[^-][^\\-<br>
--> FAILED!: 
()]*)*\))[^\\-<br>
--> FAILED!: 
()]*)*\)[ 	]*)*(?:(?:[^( <>@,;:".\\\[\]<br>
--> FAILED!: 
"]*(?:\\[^-][^\\-<br>
--> FAILED!: 
"]*)*")[^()<>@,;:".\\\[\]-<br>
--> FAILED!: -]*(?:(?:\([^\\-<br>
--> FAILED!: 
()]*(?:(?:\\[^-]|\([^\\-<br>
--> FAILED!: 
()]*(?:\\[^-][^\\-<br>
--> FAILED!: 
()]*)*\))[^\\-<br>
--> FAILED!: 
()]*)*\)|"[^\\-<br>
--> FAILED!: 
"]*(?:\\[^-][^\\-<br>
--> FAILED!: 
"]*)*")[^()<>@,;:".\\\[\]-<br>
--> FAILED!: -]*)*<[ 	]*(?:\([^\\-<br>
--> FAILED!: 
()]*(?:(?:\\[^-]|\([^\\-<br>
--> FAILED!: 
()]*(?:\\[^-][^\\-<br>
--> FAILED!: 
()]*)*\))[^\\-<br>
--> FAILED!: 
()]*)*\)[ 	]*)*(?:@[ 	]*(?:\([^\\-<br>
--> FAILED!: 
()]*(?:(?:\\[^-]|\([^\\-<br>
--> FAILED!: 
()]*(?:\\[^-][^\\-<br>
--> FAILED!: 
()]*)*\))[^\\-<br>
--> FAILED!: 
()]*)*\)[ 	]*)*(?:[^( <>@,;:".\\\[\]<br>
--> FAILED!: 
\[\]]|\\[^-])*\])[ 	]*(?:\([^\\-<br>
--> FAILED!: 
()]*(?:(?:\\[^-]|\([^\\-<br>
--> FAILED!: 
()]*(?:\\[^-][^\\-<br>
--> FAILED!: 
()]*)*\))[^\\-<br>
--> FAILED!: 
()]*)*\)[ 	]*)*(?:.[ 	]*(?:\([^\\-<br>
--> FAILED!: 
()]*(?:(?:\\[^-]|\([^\\-<br>
--> FAILED!: 
()]*(?:\\[^-][^\\-<br>
--> FAILED!: 
()]*)*\))[^\\-<br>
--> FAILED!: 
()]*)*\)[ 	]*)*(?:[^( <>@,;:".\\\[\]<br>
--> FAILED!: 
\[\]]|\\[^-])*\])[ 	]*(?:\([^\\-<br>
--> FAILED!: 
()]*(?:(?:\\[^-]|\([^\\-<br>
--> FAILED!: 
()]*(?:\\[^-][^\\-<br>
--> FAILED!: 
()]*)*\))[^\\-<br>
--> FAILED!: 
()]*)*\)[ 	]*)*)*(?:,[ 	]*(?:\([^\\-<br>
--> FAILED!: 
()]*(?:(?:\\[^-]|\([^\\-<br>
--> FAILED!: 
()]*(?:\\[^-][^\\-<br>
--> FAILED!: 
()]*)*\))[^\\-<br>
--> FAILED!: 
()]*)*\)[ 	]*)*@[ 	]*(?:\([^\\-<br>
--> FAILED!: 
()]*(?:(?:\\[^-]|\([^\\-<br>
--> FAILED!: 
()]*(?:\\[^-][^\\-<br>
--> FAILED!: 
()]*)*\))[^\\-<br>
--> FAILED!: 
()]*)*\)[ 	]*)*(?:[^( <>@,;:".\\\[\]<br>
--> FAILED!: 
\[\]]|\\[^-])*\])[ 	]*(?:\([^\\-<br>
--> FAILED!: 
()]*(?:(?:\\[^-]|\([^\\-<br>
--> FAILED!: 
()]*(?:\\[^-][^\\-<br>
--> FAILED!: 
()]*)*\))[^\\-<br>
--> FAILED!: 
()]*)*\)[ 	]*)*(?:.[ 	]*(?:\([^\\-<br>
--> FAILED!: 
()]*(?:(?:\\[^-]|\([^\\-<br>
--> FAILED!: 
()]*(?:\\[^-][^\\-<br>
--> FAILED!: 
()]*)*\))[^\\-<br>
--> FAILED!: 
()]*)*\)[ 	]*)*(?:[^( <>@,;:".\\\[\]<br>
--> FAILED!: 
\[\]]|\\[^-])*\])[ 	]*(?:\([^\\-<br>
--> FAILED!: 
()]*(?:(?:\\[^-]|\([^\\-<br>
--> FAILED!: 
()]*(?:\\[^-][^\\-<br>
--> FAILED!: 
()]*)*\))[^\\-<br>
--> FAILED!: 
()]*)*\)[ 	]*)*)*)*:[ 	]*(?:\([^\\-<br>
--> FAILED!: 
()]*(?:(?:\\[^-]|\([^\\-<br>
--> FAILED!: 
()]*(?:\\[^-][^\\-<br>
--> FAILED!: 
()]*)*\))[^\\-<br>
--> FAILED!: 
()]*)*\)[ 	]*)*)?(?:[^( <>@,;:".\\\[\]<br>
--> FAILED!: 
"]*(?:\\[^-][^\\-<br>
--> FAILED!: 
"]*)*")[ 	]*(?:\([^\\-<br>
--> FAILED!: 
()]*(?:(?:\\[^-]|\([^\\-<br>
--> FAILED!: 
()]*(?:\\[^-][^\\-<br>
--> FAILED!: 
()]*)*\))[^\\-<br>
--> FAILED!: 
()]*)*\)[ 	]*)*@[ 	]*(?:\([^\\-<br>
--> FAILED!: 
()]*(?:(?:\\[^-]|\([^\\-<br>
--> FAILED!: 
()]*(?:\\[^-][^\\-<br>
--> FAILED!: 
()]*)*\))[^\\-<br>
--> FAILED!: 
()]*)*\)[ 	]*)*(?:[^( <>@,;:".\\\[\]<br>
--> FAILED!: 
\[\]]|\\[^-])*\])[ 	]*(?:\([^\\-<br>
--> FAILED!: 
()]*(?:(?:\\[^-]|\([^\\-<br>
--> FAILED!: 
()]*(?:\\[^-][^\\-<br>
--> FAILED!: 
()]*)*\))[^\\-<br>
--> FAILED!: 
()]*)*\)[ 	]*)*(?:.[ 	]*(?:\([^\\-<br>
--> FAILED!: 
()]*(?:(?:\\[^-]|\([^\\-<br>
--> FAILED!: 
()]*(?:\\[^-][^\\-<br>
--> FAILED!: 
()]*)*\))[^\\-<br>
--> FAILED!: 
()]*)*\)[ 	]*)*(?:[^( <>@,;:".\\\[\]<br>
--> FAILED!: 
\[\]]|\\[^-])*\])[ 	]*(?:\([^\\-<br>
--> FAILED!: 
()]*(?:(?:\\[^-]|\([^\\-<br>
--> FAILED!: 
()]*(?:\\[^-][^\\-<br>
--> FAILED!: 
()]*)*\))[^\\-<br>
--> FAILED!: 
()]*)*\)[ 	]*)*)*>|(?:[^( <>@,;:".\\\[\]<br>
--> FAILED!: 
"]*(?:\\[^-][^\\-<br>
--> FAILED!: 
"]*)*")[ 	]*(?:\([^\\-<br>
--> FAILED!: 
()]*(?:(?:\\[^-]|\([^\\-<br>
--> FAILED!: 
()]*(?:\\[^-][^\\-<br>
--> FAILED!: 
()]*)*\))[^\\-<br>
--> FAILED!: 
()]*)*\)[ 	]*)*@[ 	]*(?:\([^\\-<br>
--> FAILED!: 
()]*(?:(?:\\[^-]|\([^\\-<br>
--> FAILED!: 
()]*(?:\\[^-][^\\-<br>
--> FAILED!: 
()]*)*\))[^\\-<br>
--> FAILED!: 
()]*)*\)[ 	]*)*(?:[^( <>@,;:".\\\[\]<br>
--> FAILED!: 
\[\]]|\\[^-])*\])[ 	]*(?:\([^\\-<br>
--> FAILED!: 
()]*(?:(?:\\[^-]|\([^\\-<br>
--> FAILED!: 
()]*(?:\\[^-][^\\-<br>
--> FAILED!: 
()]*)*\))[^\\-<br>
--> FAILED!: 
()]*)*\)[ 	]*)*(?:.[ 	]*(?:\([^\\-<br>
--> FAILED!: 
()]*(?:(?:\\[^-]|\([^\\-<br>
--> FAILED!: 
()]*(?:\\[^-][^\\-<br>
--> FAILED!: 
()]*)*\))[^\\-<br>
--> FAILED!: 
()]*)*\)[ 	]*)*(?:[^( <>@,;:".\\\[\]<br>
--> FAILED!: 
\[\]]|\\[^-])*\])[ 	]*(?:\([^\\-<br>
--> FAILED!: 
()]*(?:(?:\\[^-]|\([^\\-<br>
--> FAILED!: 
()]*(?:\\[^-][^\\-<br>
--> FAILED!: 
()]*)*\))[^\\-<br>
--> FAILED!: 
darin's avatar
darin committed
804
()]*)*\)[ 	]*)*)*)/g<br>
kdecker's avatar
kdecker committed
805 806 807 808 809 810
--> FAILED!: string = 'Jeffy<"That Tall Guy"@ora.com (this address is no longer acti\ve)>'<br>
--> FAILED!: ERROR !!! regexp FAILED to match anything !!!<br>
--> FAILED!: Expect: ["Jeffy<"That Tall Guy"@ora.com (this address is no longer active)>"]<br>
--> FAILED!: Actual: null<br>
--> FAILED!: <br>
</tt><br>
811 812
<a name='failure25'></a><dd><b>Testcase <a target='other_window' href='./ecma_3/Statements/regress-194364.js'>ecma_3/Statements/regress-194364.js</a> failed</b> <br>
 [ <a href='#failure24'>Previous Failure</a> | <a href='#failure26'>Next Failure</a> | <a href='#tippy_top'>Top of Page</a> ]<br>
kdecker's avatar
kdecker committed
813 814 815
<tt>Expected exit code 0, got 3<br>
Testcase terminated with signal 0<br>
Complete testcase output was:<br>
816
Exception, line 1: SyntaxError: Parse error<br>
kdecker's avatar
kdecker committed
817
</tt><br>
818 819
<a name='failure26'></a><dd><b>Testcase <a target='other_window' href='./ecma_3/Unicode/uc-001.js'>ecma_3/Unicode/uc-001.js</a> failed</b> <a href='http://bugzilla.mozilla.org/show_bug.cgi?id=23610' target='other_window'>Bug Number 23610</a><br>
 [ <a href='#failure25'>Previous Failure</a> | <a href='#failure27'>Next Failure</a> | <a href='#tippy_top'>Top of Page</a> ]<br>
kdecker's avatar
kdecker committed
820 821 822 823 824 825
<tt>--> STATUS: Unicode format-control character (Category Cf) test.<br>
Failure messages were:<br>
--> FAILED!: [reported from test()] Unicode format-control character test (Category Cf.)<br>
--> FAILED!: [reported from test()] Expected value 'no error', Actual value 'no error'<br>
--> FAILED!: [reported from test()] <br>
</tt><br>
826 827
<a name='failure27'></a><dd><b>Testcase <a target='other_window' href='./ecma_3/Unicode/uc-002.js'>ecma_3/Unicode/uc-002.js</a> failed</b> <a href='http://bugzilla.mozilla.org/show_bug.cgi?id=23613' target='other_window'>Bug Number 23613</a><br>
 [ <a href='#failure26'>Previous Failure</a> | <a href='#failure28'>Next Failure</a> | <a href='#tippy_top'>Top of Page</a> ]<br>
kdecker's avatar
kdecker committed
828 829 830 831 832 833
<tt>--> STATUS: Unicode non-breaking space character test.<br>
Failure messages were:<br>
--> FAILED!: [reported from test()] Unicode non-breaking space character regexp test.<br>
--> FAILED!: [reported from test()] Expected value '0', Actual value '-1'<br>
--> FAILED!: [reported from test()] <br>
</tt><br>
834 835
<a name='failure28'></a><dd><b>Testcase <a target='other_window' href='./ecma_3/Unicode/uc-003.js'>ecma_3/Unicode/uc-003.js</a> failed</b> <br>
 [ <a href='#failure27'>Previous Failure</a> | <a href='#failure29'>Next Failure</a> | <a href='#tippy_top'>Top of Page</a> ]<br>
kdecker's avatar
kdecker committed
836 837 838 839
<tt>Expected exit code 0, got 3<br>
Testcase terminated with signal 0<br>
Complete testcase output was:<br>
yylex: ERROR.<br>
840
Exception, line 32: SyntaxError: Parse error<br>
kdecker's avatar
kdecker committed
841
</tt><br>
842 843
<a name='failure29'></a><dd><b>Testcase <a target='other_window' href='./ecma_3/Unicode/uc-005.js'>ecma_3/Unicode/uc-005.js</a> failed</b> <br>
 [ <a href='#failure28'>Previous Failure</a> | <a href='#failure30'>Next Failure</a> | <a href='#tippy_top'>Top of Page</a> ]<br>
kdecker's avatar
kdecker committed
844 845 846 847
<tt>Expected exit code 0, got 3<br>
Testcase terminated with signal 0<br>
Complete testcase output was:<br>
yylex: ERROR.<br>
848
Exception, line 118: SyntaxError: Parse error<br>
kdecker's avatar
kdecker committed
849
</tt><br>
850 851
<a name='failure30'></a><dd><b>Testcase <a target='other_window' href='./js1_2/Array/tostring_1.js'>js1_2/Array/tostring_1.js</a> failed</b> <br>
 [ <a href='#failure29'>Previous Failure</a> | <a href='#failure31'>Next Failure</a> | <a href='#tippy_top'>Top of Page</a> ]<br>
kdecker's avatar
kdecker committed
852 853 854 855 856 857 858 859 860 861
<tt><br>
Failure messages were:<br>
--> var a = new Array(); a.toString() =  FAILED! expected: []<br>
--> a[0] = void 0; a.toString() =  FAILED! expected: [, ]<br>
--> a[1] = void 0; a.toString() = , FAILED! expected: [, , ]<br>
--> a[1] = "hi"; a.toString() = ,hi FAILED! expected: [, "hi"]<br>
--> a[2] = void 0; a.toString() = ,hi, FAILED! expected: [, "hi", , ]<br>
--> var b = new Array(1000); b.toString() = ,,,,,,,,,,,,,,,,,,,,,,,,,,,,,,,,,,,,,,,,,,,,,,,,,,,,,,,,,,,,,,,,,,,,,,,,,,,,,,,,,,,,,,,,,,,,,,,,,,,,,,,,,,,,,,,,,,,,,,,,,,,,,,,,,,,,,,,,,,,,,,,,,,,,,,,,,,,,,,,,,,,,,,,,,,,,,,,,,,,,,,,,,,,,,,,,,,,,,,,,,,,,,,,,,,,,,,,,,,,,,,,,,,,,,,,,,,,,,,,,,,,,,,,,,,,,,,,,,,,,,,,,,,,,,,,,,,,,,,,,,,,,,,,,,,,,,,,,,,,,,,,,,,,,,,,,,,,,,,,,,,,,,,,,,,,,,,,,,,,,,,,,,,,,,,,,,,,,,,,,,,,,,,,,,,,,,,,,,,,,,,,,,,,,,,,,,,,,,,,,,,,,,,,,,,,,,,,,,,,,,,,,,,,,,,,,,,,,,,,,,,,,,,,,,,,,,,,,,,,,,,,,,,,,,,,,,,,,,,,,,,,,,,,,,,,,,,,,,,,,,,,,,,,,,,,,,,,,,,,,,,,,,,,,,,,,,,,,,,,,,,,,,,,,,,,,,,,,,,,,,,,,,,,,,,,,,,,,,,,,,,,,,,,,,,,,,,,,,,,,,,,,,,,,,,,,,,,,,,,,,,,,,,,,,,,,,,,,,,,,,,,,,,,,,,,,,,,,,,,,,,,,,,,,,,,,,,,,,,,,,,,,,,,,,,,,,,,,,,,,,,,,,,,,,,,,,,,,,,,,,,,,,,,,,,,,,,,,,,,,,,,,,,,,,,,,,,,,,,,,,,,,,,,,,,,,,,,,,,,,,,,,,,,,,,,,,,,,,,,,,,,,,,,,,,,,,,,,,,,,,,,,,,,,,,,,,,,,,,,,,,,,,,,,,,,,,,,,,,,,,,,,,,,,,,,,,,,,,,,,,,,,,,,,,,,,,,,,,,,,,,,,,,,,,,,,,,,,,,,,,,,,,,,,,,,,,,,,,,,,,,,,,,,,,,,,,,,,,,,,,,,,,,,,,,,,,,,,,,,,,,,,,,,,,,,,,,,,,,, FAILED! expected: [1000]<br>
--> b.length = 1000 FAILED! expected: 1<br>
</tt><br>
862 863
<a name='failure31'></a><dd><b>Testcase <a target='other_window' href='./js1_2/Array/tostring_2.js'>js1_2/Array/tostring_2.js</a> failed</b> <br>
 [ <a href='#failure30'>Previous Failure</a> | <a href='#failure32'>Next Failure</a> | <a href='#tippy_top'>Top of Page</a> ]<br>
kdecker's avatar
kdecker committed
864 865 866 867 868 869
<tt><br>
Failure messages were:<br>
--> a.toString() =  FAILED! expected: []<br>
--> String( a ) =  FAILED! expected: []<br>
--> a +'' =  FAILED! expected: []<br>
</tt><br>
870 871
<a name='failure32'></a><dd><b>Testcase <a target='other_window' href='./js1_2/function/function-001-n.js'>js1_2/function/function-001-n.js</a> failed</b> <br>
 [ <a href='#failure31'>Previous Failure</a> | <a href='#failure33'>Next Failure</a> | <a href='#tippy_top'>Top of Page</a> ]<br>
kdecker's avatar
kdecker committed
872 873 874 875 876 877 878
<tt>Expected exit code 3, got 0<br>
Testcase terminated with signal 0<br>
Complete testcase output was:<br>
--> function-001.js functions not separated by semicolons are errors in version 120 and higher<br>
--> eval("function f(){}function g(){}") = undefined FAILED! expected: error<br>
OK.<br>
</tt><br>
879 880
<a name='failure33'></a><dd><b>Testcase <a target='other_window' href='./js1_2/function/Function_object.js'>js1_2/function/Function_object.js</a> failed</b> <br>
 [ <a href='#failure32'>Previous Failure</a> | <a href='#failure34'>Next Failure</a> | <a href='#tippy_top'>Top of Page</a> ]<br>
kdecker's avatar
kdecker committed
881 882 883 884 885 886 887
<tt><br>
Failure messages were:<br>
--> f.name = undefined FAILED! expected: a_test_function<br>
--> f.arity = undefined FAILED! expected: 3<br>
--> (new Function()).name = undefined FAILED! expected: anonymous<br>
} FAILED! expected: <br>
</tt><br>
888 889
<a name='failure34'></a><dd><b>Testcase <a target='other_window' href='./js1_2/function/Number.js'>js1_2/function/Number.js</a> failed</b> <br>
 [ <a href='#failure33'>Previous Failure</a> | <a href='#failure35'>Next Failure</a> | <a href='#tippy_top'>Top of Page</a> ]<br>
kdecker's avatar
kdecker committed
890 891 892 893
<tt><br>
Failure messages were:<br>
--> Number([1,2,3])          = NaN FAILED! expected: 3<br>
</tt><br>
894 895
<a name='failure35'></a><dd><b>Testcase <a target='other_window' href='./js1_2/function/regexparg-1.js'>js1_2/function/regexparg-1.js</a> failed</b> <br>
 [ <a href='#failure34'>Previous Failure</a> | <a href='#failure36'>Next Failure</a> | <a href='#tippy_top'>Top of Page</a> ]<br>
kdecker's avatar
kdecker committed
896 897 898 899
<tt>Expected exit code 0, got 3<br>
Testcase terminated with signal 0<br>
Complete testcase output was:<br>
--> JS_1.2 The variable statment<br>
900
Exception, line 81: TypeError: Object /abc/ (result of expression x) does not allow calls.<br>
kdecker's avatar
kdecker committed
901
</tt><br>
902 903
<a name='failure36'></a><dd><b>Testcase <a target='other_window' href='./js1_2/function/String.js'>js1_2/function/String.js</a> failed</b> <br>
 [ <a href='#failure35'>Previous Failure</a> | <a href='#failure37'>Next Failure</a> | <a href='#tippy_top'>Top of Page</a> ]<br>
kdecker's avatar
kdecker committed
904 905 906 907 908
<tt><br>
Failure messages were:<br>
--> String({p:1})            = [object Object] FAILED! expected: {p:1}<br>
--> String([1,2,3])             = 1,2,3 FAILED! expected: [1, 2, 3]<br>
</tt><br>
909 910
<a name='failure37'></a><dd><b>Testcase <a target='other_window' href='./js1_2/function/tostring-1.js'>js1_2/function/tostring-1.js</a> failed</b> <br>
 [ <a href='#failure36'>Previous Failure</a> | <a href='#failure38'>Next Failure</a> | <a href='#tippy_top'>Top of Page</a> ]<br>
kdecker's avatar
kdecker committed
911 912 913 914 915 916 917 918
<tt><br>
Failure messages were:<br>
} FAILED! expected: <br>
} FAILED! expected: <br>
} FAILED! expected: <br>
} FAILED! expected: <br>
} FAILED! expected: <br>
</tt><br>
919 920
<a name='failure38'></a><dd><b>Testcase <a target='other_window' href='./js1_2/function/tostring-2.js'>js1_2/function/tostring-2.js</a> failed</b> <br>
 [ <a href='#failure37'>Previous Failure</a> | <a href='#failure39'>Next Failure</a> | <a href='#tippy_top'>Top of Page</a> ]<br>
kdecker's avatar
kdecker committed
921 922 923 924 925 926 927 928 929 930 931 932
<tt><br>
Failure messages were:<br>
} FAILED! expected: <br>
} FAILED! expected: <br>
} FAILED! expected: <br>
} FAILED! expected: <br>
} FAILED! expected: <br>
} FAILED! expected: <br>
} FAILED! expected: <br>
} FAILED! expected: <br>
} FAILED! expected: <br>
</tt><br>
933 934
<a name='failure39'></a><dd><b>Testcase <a target='other_window' href='./js1_2/Objects/toString-001.js'>js1_2/Objects/toString-001.js</a> failed</b> <br>
 [ <a href='#failure38'>Previous Failure</a> | <a href='#failure40'>Next Failure</a> | <a href='#tippy_top'>Top of Page</a> ]<br>
kdecker's avatar
kdecker committed
935 936 937 938
<tt>Expected exit code 0, got 3<br>
Testcase terminated with signal 0<br>
Complete testcase output was:<br>
--> JS1_2 Object.toString()<br>
939
Exception, line 104: TypeError: Object /^\{(.*)\}$/ (result of expression ^\{(.*)\}$) does not allow calls.<br>
kdecker's avatar
kdecker committed
940
</tt><br>
941 942
<a name='failure40'></a><dd><b>Testcase <a target='other_window' href='./js1_2/operator/equality.js'>js1_2/operator/equality.js</a> failed</b> <br>
 [ <a href='#failure39'>Previous Failure</a> | <a href='#failure41'>Next Failure</a> | <a href='#tippy_top'>Top of Page</a> ]<br>
kdecker's avatar
kdecker committed
943 944 945 946 947
<tt><br>
Failure messages were:<br>
--> (new String('x') == 'x')                  = true FAILED! expected: false<br>
--> ('x' == new String('x'))                  = true FAILED! expected: false<br>
</tt><br>
948 949
<a name='failure41'></a><dd><b>Testcase <a target='other_window' href='./js1_2/regexp/beginLine.js'>js1_2/regexp/beginLine.js</a> failed</b> <br>
 [ <a href='#failure40'>Previous Failure</a> | <a href='#failure42'>Next Failure</a> | <a href='#tippy_top'>Top of Page</a> ]<br>
kdecker's avatar
kdecker committed
950 951 952 953
<tt><br>
Failure messages were:<br>
123xyz'.match(new RegExp('^\d+')) = null FAILED! expected: 123<br>
</tt><br>
954 955
<a name='failure42'></a><dd><b>Testcase <a target='other_window' href='./js1_2/regexp/compile.js'>js1_2/regexp/compile.js</a> failed</b> <br>
 [ <a href='#failure41'>Previous Failure</a> | <a href='#failure43'>Next Failure</a> | <a href='#tippy_top'>Top of Page</a> ]<br>
kdecker's avatar
kdecker committed
956 957 958 959 960
<tt>Expected exit code 0, got 3<br>
Testcase terminated with signal 0<br>
Complete testcase output was:<br>
--> Executing script: compile.js<br>
--> As described in Netscape doc "Whats new in JavaScript 1.2" RegExp: compile<br>
961
Exception, line 44: TypeError: Value undefined (result of expression regularExpression.compile) is not object.<br>
kdecker's avatar
kdecker committed
962
</tt><br>
963 964
<a name='failure43'></a><dd><b>Testcase <a target='other_window' href='./js1_2/regexp/endLine.js'>js1_2/regexp/endLine.js</a> failed</b> <br>
 [ <a href='#failure42'>Previous Failure</a> | <a href='#failure44'>Next Failure</a> | <a href='#tippy_top'>Top of Page</a> ]<br>
kdecker's avatar
kdecker committed
965 966 967 968
<tt><br>
Failure messages were:<br>
xyz'.match(new RegExp('\d+$')) = null FAILED! expected: 890<br>
</tt><br>
969 970
<a name='failure44'></a><dd><b>Testcase <a target='other_window' href='./js1_2/regexp/RegExp_input.js'>js1_2/regexp/RegExp_input.js</a> failed</b> <br>
 [ <a href='#failure43'>Previous Failure</a> | <a href='#failure45'>Next Failure</a> | <a href='#tippy_top'>Top of Page</a> ]<br>
kdecker's avatar
kdecker committed
971 972 973 974 975 976 977 978
<tt><br>
Failure messages were:<br>
--> RegExp.input = 'abcd12357efg'; /\d+/.exec() = null FAILED! expected: 12357<br>
--> RegExp.input = 'abcd12357efg'; /[h-z]+/.exec() = un FAILED! expected: null<br>
--> RegExp.input = 'abcd12357efg'; /\d+/.test() = false FAILED! expected: true<br>
--> RegExp.input = 'abcd12357efg'; /[h-z]+/.test() = true FAILED! expected: false<br>
--> RegExp.input = 'abcd12357efg'; (new RegExp('[h-z]+')).test() = true FAILED! expected: false<br>
</tt><br>
979 980
<a name='failure45'></a><dd><b>Testcase <a target='other_window' href='./js1_2/regexp/RegExp_input_as_array.js'>js1_2/regexp/RegExp_input_as_array.js</a> failed</b> <br>
 [ <a href='#failure44'>Previous Failure</a> | <a href='#failure46'>Next Failure</a> | <a href='#tippy_top'>Top of Page</a> ]<br>
kdecker's avatar
kdecker committed
981 982 983 984 985 986 987 988
<tt><br>
Failure messages were:<br>
--> RegExp['$_'] = 'abcd12357efg'; /\d+/.exec() = null FAILED! expected: 12357<br>
--> RegExp['$_'] = 'abcd12357efg'; /[h-z]+/.exec() = un FAILED! expected: null<br>
--> RegExp['$_'] = 'abcd12357efg'; /\d+/.test() = false FAILED! expected: true<br>
--> RegExp['$_'] = 'abcd12357efg'; /[h-z]+/.test() = true FAILED! expected: false<br>
--> RegExp['$_'] = 'abcd12357efg'; (new RegExp('[h-z]+')).test() = true FAILED! expected: false<br>
</tt><br>
989 990
<a name='failure46'></a><dd><b>Testcase <a target='other_window' href='./js1_2/regexp/RegExp_lastIndex.js'>js1_2/regexp/RegExp_lastIndex.js</a> failed</b> <br>
 [ <a href='#failure45'>Previous Failure</a> | <a href='#failure47'>Next Failure</a> | <a href='#tippy_top'>Top of Page</a> ]<br>
kdecker's avatar
kdecker committed
991 992 993 994 995
<tt><br>
Failure messages were:<br>
--> re=/x./g; re.lastIndex=4; re.exec('xyabcdxa') = xa FAILED! expected: ["xa"]<br>
--> re.exec('xyabcdef') = xy FAILED! expected: ["xy"]<br>
</tt><br>
996 997
<a name='failure47'></a><dd><b>Testcase <a target='other_window' href='./js1_2/regexp/RegExp_lastMatch.js'>js1_2/regexp/RegExp_lastMatch.js</a> failed</b> <br>
 [ <a href='#failure46'>Previous Failure</a> | <a href='#failure48'>Next Failure</a> | <a href='#tippy_top'>Top of Page</a> ]<br>
kdecker's avatar
kdecker committed
998 999 1000 1001 1002 1003 1004 1005 1006
<tt><br>
Failure messages were:<br>
--> 'foo'.match(/foo/); RegExp.lastMatch = undefined FAILED! expected: foo<br>
--> 'foo'.match(new RegExp('foo')); RegExp.lastMatch = undefined FAILED! expected: foo<br>
--> 'xxx'.match(/bar/); RegExp.lastMatch = undefined FAILED! expected: foo<br>
--> 'xxx'.match(/$/); RegExp.lastMatch = undefined FAILED! expected: <br>
--> 'abcdefg'.match(/^..(cd)[a-z]+/); RegExp.lastMatch = undefined FAILED! expected: abcdefg<br>
--> 'abcdefgabcdefg'.match(/(a(b(c(d)e)f)g)\1/); RegExp.lastMatch = undefined FAILED! expected: abcdefgabcdefg<br>
</tt><br>
1007 1008
<a name='failure48'></a><dd><b>Testcase <a target='other_window' href='./js1_2/regexp/RegExp_lastMatch_as_array.js'>js1_2/regexp/RegExp_lastMatch_as_array.js</a> failed</b> <br>
 [ <a href='#failure47'>Previous Failure</a> | <a href='#failure49'>Next Failure</a> | <a href='#tippy_top'>Top of Page</a> ]<br>
kdecker's avatar
kdecker committed
1009 1010 1011 1012 1013 1014 1015 1016 1017
<tt><br>
Failure messages were:<br>
--> 'foo'.match(/foo/); RegExp['$&'] = undefined FAILED! expected: foo<br>
--> 'foo'.match(new RegExp('foo')); RegExp['$&'] = undefined FAILED! expected: foo<br>
--> 'xxx'.match(/bar/); RegExp['$&'] = undefined FAILED! expected: foo<br>
--> 'xxx'.match(/$/); RegExp['$&'] = undefined FAILED! expected: <br>
--> 'abcdefg'.match(/^..(cd)[a-z]+/); RegExp['$&'] = undefined FAILED! expected: abcdefg<br>
--> 'abcdefgabcdefg'.match(/(a(b(c(d)e)f)g)\1/); RegExp['$&'] = undefined FAILED! expected: abcdefgabcdefg<br>
</tt><br>
1018 1019
<a name='failure49'></a><dd><b>Testcase <a target='other_window' href='./js1_2/regexp/RegExp_lastParen.js'>js1_2/regexp/RegExp_lastParen.js</a> failed</b> <br>
 [ <a href='#failure48'>Previous Failure</a> | <a href='#failure50'>Next Failure</a> | <a href='#tippy_top'>Top of Page</a> ]<br>
kdecker's avatar
kdecker committed
1020 1021 1022 1023 1024 1025 1026 1027 1028 1029 1030 1031
<tt><br>
Failure messages were:<br>
--> 'abcd'.match(/(abc)d/); RegExp.lastParen = undefined FAILED! expected: abc<br>
--> 'abcd'.match(new RegExp('(abc)d')); RegExp.lastParen = undefined FAILED! expected: abc<br>
--> 'abcd'.match(/(bcd)e/); RegExp.lastParen = undefined FAILED! expected: abc<br>
--> 'abcdefg'.match(/(a(b(c(d)e)f)g)/); RegExp.lastParen = undefined FAILED! expected: d<br>
--> 'abcdefg'.match(/(a(b)c)(d(e)f)/); RegExp.lastParen = undefined FAILED! expected: e<br>
--> 'abcdefg'.match(/(^)abc/); RegExp.lastParen = undefined FAILED! expected: <br>
--> 'abcdefg'.match(/(^a)bc/); RegExp.lastParen = undefined FAILED! expected: a<br>
--> 'abcdefg'.match(new RegExp('(^a)bc')); RegExp.lastParen = undefined FAILED! expected: a<br>
--> 'abcdefg'.match(/bc/); RegExp.lastParen = undefined FAILED! expected: <br>
</tt><br>
1032 1033
<a name='failure50'></a><dd><b>Testcase <a target='other_window' href='./js1_2/regexp/RegExp_lastParen_as_array.js'>js1_2/regexp/RegExp_lastParen_as_array.js</a> failed</b> <br>
 [ <a href='#failure49'>Previous Failure</a> | <a href='#failure51'>Next Failure</a> | <a href='#tippy_top'>Top of Page</a> ]<br>
kdecker's avatar
kdecker committed
1034 1035 1036 1037 1038 1039 1040 1041 1042 1043 1044 1045
<tt><br>
Failure messages were:<br>
--> 'abcd'.match(/(abc)d/); RegExp['$+'] = undefined FAILED! expected: abc<br>
--> 'abcd'.match(/(bcd)e/); RegExp['$+'] = undefined FAILED! expected: abc<br>
--> 'abcdefg'.match(/(a(b(c(d)e)f)g)/); RegExp['$+'] = undefined FAILED! expected: d<br>
--> 'abcdefg'.match(new RegExp('(a(b(c(d)e)f)g)')); RegExp['$+'] = undefined FAILED! expected: d<br>
--> 'abcdefg'.match(/(a(b)c)(d(e)f)/); RegExp['$+'] = undefined FAILED! expected: e<br>
--> 'abcdefg'.match(/(^)abc/); RegExp['$+'] = undefined FAILED! expected: <br>
--> 'abcdefg'.match(/(^a)bc/); RegExp['$+'] = undefined FAILED! expected: a<br>
--> 'abcdefg'.match(new RegExp('(^a)bc')); RegExp['$+'] = undefined FAILED! expected: a<br>
--> 'abcdefg'.match(/bc/); RegExp['$+'] = undefined FAILED! expected: <br>
</tt><br>
1046 1047
<a name='failure51'></a><dd><b>Testcase <a target='other_window' href='./js1_2/regexp/RegExp_leftContext.js'>js1_2/regexp/RegExp_leftContext.js</a> failed</b> <br>
 [ <a href='#failure50'>Previous Failure</a> | <a href='#failure52'>Next Failure</a> | <a href='#tippy_top'>Top of Page</a> ]<br>
kdecker's avatar
kdecker committed
1048 1049 1050 1051 1052 1053 1054 1055 1056 1057
<tt><br>
Failure messages were:<br>
--> 'abc123xyz'.match(/123/); RegExp.leftContext = undefined FAILED! expected: abc<br>
--> 'abc123xyz'.match(/456/); RegExp.leftContext = undefined FAILED! expected: abc<br>
--> 'abc123xyz'.match(/abc123xyz/); RegExp.leftContext = undefined FAILED! expected: <br>
--> 'xxxx'.match(/$/); RegExp.leftContext = undefined FAILED! expected: xxxx<br>
--> 'test'.match(/^/); RegExp.leftContext = undefined FAILED! expected: <br>
--> 'xxxx'.match(new RegExp('$')); RegExp.leftContext = undefined FAILED! expected: xxxx<br>
--> 'test'.match(new RegExp('^')); RegExp.leftContext = undefined FAILED! expected: <br>
</tt><br>
1058 1059
<a name='failure52'></a><dd><b>Testcase <a target='other_window' href='./js1_2/regexp/RegExp_leftContext_as_array.js'>js1_2/regexp/RegExp_leftContext_as_array.js</a> failed</b> <br>
 [ <a href='#failure51'>Previous Failure</a> | <a href='#failure53'>Next Failure</a> | <a href='#tippy_top'>Top of Page</a> ]<br>
kdecker's avatar
kdecker committed
1060 1061 1062 1063 1064 1065 1066 1067 1068 1069
<tt><br>
Failure messages were:<br>
--> 'abc123xyz'.match(/123/); RegExp['$`'] = undefined FAILED! expected: abc<br>
--> 'abc123xyz'.match(/456/); RegExp['$`'] = undefined FAILED! expected: abc<br>
--> 'abc123xyz'.match(/abc123xyz/); RegExp['$`'] = undefined FAILED! expected: <br>
--> 'xxxx'.match(/$/); RegExp['$`'] = undefined FAILED! expected: xxxx<br>
--> 'test'.match(/^/); RegExp['$`'] = undefined FAILED! expected: <br>
--> 'xxxx'.match(new RegExp('$')); RegExp['$`'] = undefined FAILED! expected: xxxx<br>
--> 'test'.match(new RegExp('^')); RegExp['$`'] = undefined FAILED! expected: <br>
</tt><br>
1070 1071
<a name='failure53'></a><dd><b>Testcase <a target='other_window' href='./js1_2/regexp/RegExp_multiline.js'>js1_2/regexp/RegExp_multiline.js</a> failed</b> <br>
 [ <a href='#failure52'>Previous Failure</a> | <a href='#failure54'>Next Failure</a> | <a href='#tippy_top'>Top of Page</a> ]<br>
kdecker's avatar
kdecker committed
1072 1073 1074 1075 1076 1077 1078 1079 1080
<tt><br>
Failure messages were:<br>
--> RegExp.multiline = undefined FAILED! expected: false<br>
--> (multiline == true) '123\n456'.match(/^4../) = null FAILED! expected: 456<br>
--> (multiline == true) 'a11\na22\na23\na24'.match(/^a../g) = a11 FAILED! expected: a11,a22,a23,a24<br>
--> (multiline == true) '123\n456'.match(/.3$/) = null FAILED! expected: 23<br>
--> (multiline == true) 'a11\na22\na23\na24'.match(/a..$/g) = a24 FAILED! expected: a11,a22,a23,a24<br>
--> (multiline == true) 'a11\na22\na23\na24'.match(new RegExp('a..$','g')) = a24 FAILED! expected: a11,a22,a23,a24<br>
</tt><br>
1081 1082
<a name='failure54'></a><dd><b>Testcase <a target='other_window' href='./js1_2/regexp/RegExp_multiline_as_array.js'>js1_2/regexp/RegExp_multiline_as_array.js</a> failed</b> <br>
 [ <a href='#failure53'>Previous Failure</a> | <a href='#failure55'>Next Failure</a> | <a href='#tippy_top'>Top of Page</a> ]<br>
kdecker's avatar
kdecker committed
1083 1084 1085 1086 1087 1088 1089 1090 1091
<tt><br>
Failure messages were:<br>
--> RegExp['$*'] = undefined FAILED! expected: false<br>
--> (['$*'] == true) '123\n456'.match(/^4../) = null FAILED! expected: 456<br>
--> (['$*'] == true) 'a11\na22\na23\na24'.match(/^a../g) = a11 FAILED! expected: a11,a22,a23,a24<br>
--> (['$*'] == true) '123\n456'.match(/.3$/) = null FAILED! expected: 23<br>
--> (['$*'] == true) 'a11\na22\na23\na24'.match(/a..$/g) = a24 FAILED! expected: a11,a22,a23,a24<br>
--> (['$*'] == true) 'a11\na22\na23\na24'.match(new RegExp('a..$','g')) = a24 FAILED! expected: a11,a22,a23,a24<br>
</tt><br>
1092 1093
<a name='failure55'></a><dd><b>Testcase <a target='other_window' href='./js1_2/regexp/RegExp_rightContext.js'>js1_2/regexp/RegExp_rightContext.js</a> failed</b> <br>
 [ <a href='#failure54'>Previous Failure</a> | <a href='#failure56'>Next Failure</a> | <a href='#tippy_top'>Top of Page</a> ]<br>
kdecker's avatar
kdecker committed
1094 1095 1096 1097 1098 1099 1100 1101 1102 1103
<tt><br>
Failure messages were:<br>
--> 'abc123xyz'.match(/123/); RegExp.rightContext = undefined FAILED! expected: xyz<br>
--> 'abc123xyz'.match(/456/); RegExp.rightContext = undefined FAILED! expected: xyz<br>
--> 'abc123xyz'.match(/abc123xyz/); RegExp.rightContext = undefined FAILED! expected: <br>
--> 'xxxx'.match(/$/); RegExp.rightContext = undefined FAILED! expected: <br>
--> 'test'.match(/^/); RegExp.rightContext = undefined FAILED! expected: test<br>
--> 'xxxx'.match(new RegExp('$')); RegExp.rightContext = undefined FAILED! expected: <br>
--> 'test'.match(new RegExp('^')); RegExp.rightContext = undefined FAILED! expected: test<br>
</tt><br>
1104 1105
<a name='failure56'></a><dd><b>Testcase <a target='other_window' href='./js1_2/regexp/RegExp_rightContext_as_array.js'>js1_2/regexp/RegExp_rightContext_as_array.js</a> failed</b> <br>
 [ <a href='#failure55'>Previous Failure</a> | <a href='#failure57'>Next Failure</a> | <a href='#tippy_top'>Top of Page</a> ]<br>
kdecker's avatar
kdecker committed
1106 1107 1108 1109 1110 1111 1112 1113 1114 1115
<tt><br>
Failure messages were:<br>
--> 'abc123xyz'.match(/123/); RegExp['$''] = undefined FAILED! expected: xyz<br>
--> 'abc123xyz'.match(/456/); RegExp['$''] = undefined FAILED! expected: xyz<br>
--> 'abc123xyz'.match(/abc123xyz/); RegExp['$''] = undefined FAILED! expected: <br>
--> 'xxxx'.match(/$/); RegExp['$''] = undefined FAILED! expected: <br>
--> 'test'.match(/^/); RegExp['$''] = undefined FAILED! expected: test<br>
--> 'xxxx'.match(new RegExp('$')); RegExp['$''] = undefined FAILED! expected: <br>
--> 'test'.match(new RegExp('^')); RegExp['$''] = undefined FAILED! expected: test<br>
</tt><br>
1116 1117
<a name='failure57'></a><dd><b>Testcase <a target='other_window' href='./js1_2/regexp/regress-6359.js'>js1_2/regexp/regress-6359.js</a> failed</b> <a href='http://bugzilla.mozilla.org/show_bug.cgi?id=http://bugzilla.mozilla.org/show_bug.cgi?id=6359' target='other_window'>Bug Number http://bugzilla.mozilla.org/show_bug.cgi?id=6359</a><br>
 [ <a href='#failure56'>Previous Failure</a> | <a href='#failure58'>Next Failure</a> | <a href='#tippy_top'>Top of Page</a> ]<br>
kdecker's avatar
kdecker committed
1118 1119 1120 1121
<tt>Expected exit code 0, got 3<br>
Testcase terminated with signal 0<br>
Complete testcase output was:<br>
--> BUGNUMBER: http://bugzilla.mozilla.org/show_bug.cgi?id=6359<br>
1122
Exception, line 57: TypeError: Object /(a*)b\1+/ (result of expression (a*)b\1+) does not allow calls.<br>
kdecker's avatar
kdecker committed
1123
</tt><br>
1124 1125
<a name='failure58'></a><dd><b>Testcase <a target='other_window' href='./js1_2/regexp/regress-9141.js'>js1_2/regexp/regress-9141.js</a> failed</b> <a href='http://bugzilla.mozilla.org/show_bug.cgi?id=http://bugzilla.mozilla.org/show_bug.cgi?id=9141' target='other_window'>Bug Number http://bugzilla.mozilla.org/show_bug.cgi?id=9141</a><br>
 [ <a href='#failure57'>Previous Failure</a> | <a href='#failure59'>Next Failure</a> | <a href='#tippy_top'>Top of Page</a> ]<br>
kdecker's avatar
kdecker committed
1126 1127 1128 1129
<tt>Expected exit code 0, got 3<br>
Testcase terminated with signal 0<br>
Complete testcase output was:<br>
--> BUGNUMBER: http://bugzilla.mozilla.org/show_bug.cgi?id=9141<br>
1130
Exception, line 74: TypeError: Object /(?:xx|x)*/ (result of expression (?:xx|x)*) does not allow calls.<br>
kdecker's avatar
kdecker committed
1131
</tt><br>
1132 1133
<a name='failure59'></a><dd><b>Testcase <a target='other_window' href='./js1_2/regexp/simple_form.js'>js1_2/regexp/simple_form.js</a> failed</b> <br>
 [ <a href='#failure58'>Previous Failure</a> | <a href='#failure60'>Next Failure</a> | <a href='#tippy_top'>Top of Page</a> ]<br>
kdecker's avatar
kdecker committed
1134 1135 1136 1137 1138
<tt>Expected exit code 0, got 3<br>
Testcase terminated with signal 0<br>
Complete testcase output was:<br>
--> Executing script: simple_form.js<br>
--> As described in Netscape doc "Whats new in JavaScript 1.2" RegExp: simple form<br>
1139
Exception, line 44: TypeError: Object /[0-9]{3}/ (result of expression [0-9]{3}) does not allow calls.<br>
kdecker's avatar
kdecker committed
1140
</tt><br>
1141 1142
<a name='failure60'></a><dd><b>Testcase <a target='other_window' href='./js1_2/regexp/special_characters.js'>js1_2/regexp/special_characters.js</a> failed</b> <br>
 [ <a href='#failure59'>Previous Failure</a> | <a href='#failure61'>Next Failure</a> | <a href='#tippy_top'>Top of Page</a> ]<br>
kdecker's avatar
kdecker committed
1143 1144 1145 1146
<tt><br>
Failure messages were:<br>
--> 'ab a  b'.match(/a{2}/) = null FAILED! expected: a<br>
</tt><br>
1147 1148
<a name='failure61'></a><dd><b>Testcase <a target='other_window' href='./js1_2/regexp/string_split.js'>js1_2/regexp/string_split.js</a> failed</b> <br>
 [ <a href='#failure60'>Previous Failure</a> | <a href='#failure62'>Next Failure</a> | <a href='#tippy_top'>Top of Page</a> ]<br>
kdecker's avatar
kdecker committed
1149 1150 1151 1152 1153 1154 1155
<tt><br>
Failure messages were:<br>
--> 'abc'.split(/[a-z]/) = ,,, FAILED! expected: ,,<br>
--> 'abc'.split(/[a-z]/) = ,,, FAILED! expected: ,,<br>
--> 'abc'.split(new RegExp('[a-z]')) = ,,, FAILED! expected: ,,<br>
--> 'abc'.split(new RegExp('[a-z]')) = ,,, FAILED! expected: ,,<br>
</tt><br>
1156 1157
<a name='failure62'></a><dd><b>Testcase <a target='other_window' href='./js1_2/String/concat.js'>js1_2/String/concat.js</a> failed</b> <br>
 [ <a href='#failure61'>Previous Failure</a> | <a href='#failure63'>Next Failure</a> | <a href='#tippy_top'>Top of Page</a> ]<br>
kdecker's avatar
kdecker committed
1158 1159 1160 1161 1162 1163 1164
<tt><br>
Failure messages were:<br>
--> aString.concat([])      = test string FAILED! expected: test string[]<br>
--> aString.concat([1,2,3]) = test string1,2,3 FAILED! expected: test string[1, 2, 3]<br>
--> 'abcde'.concat([])      = abcde FAILED! expected: abcde[]<br>
--> 'abcde'.concat([1,2,3]) = abcde1,2,3 FAILED! expected: abcde[1, 2, 3]<br>
</tt><br>
1165 1166
<a name='failure63'></a><dd><b>Testcase <a target='other_window' href='./js1_2/String/slice.js'>js1_2/String/slice.js</a> failed</b> <br>
 [ <a href='#failure62'>Previous Failure</a> | <a href='#failure64'>Next Failure</a> | <a href='#tippy_top'>Top of Page</a> ]<br>
kdecker's avatar
kdecker committed
1167 1168 1169 1170 1171
<tt><br>
Failure messages were:<br>
--> exhaustive String.slice test 1 = false FAILED! expected: true<br>
--> exhaustive String.slice test 2 = false FAILED! expected: true<br>
</tt><br>
1172 1173
<a name='failure64'></a><dd><b>Testcase <a target='other_window' href='./js1_2/version120/boolean-001.js'>js1_2/version120/boolean-001.js</a> failed</b> <br>
 [ <a href='#failure63'>Previous Failure</a> | <a href='#failure65'>Next Failure</a> | <a href='#tippy_top'>Top of Page</a> ]<br>
kdecker's avatar
kdecker committed
1174 1175 1176 1177
<tt><br>
Failure messages were:<br>
--> new Boolean(false) = true FAILED! expected: false<br>
</tt><br>
1178 1179
<a name='failure65'></a><dd><b>Testcase <a target='other_window' href='./js1_2/version120/regress-99663.js'>js1_2/version120/regress-99663.js</a> failed</b> <br>
 [ <a href='#failure64'>Previous Failure</a> | <a href='#failure66'>Next Failure</a> | <a href='#tippy_top'>Top of Page</a> ]<br>
kdecker's avatar
kdecker committed
1180 1181 1182 1183 1184 1185
<tt>--> STATUS: Regression test for Bugzilla bug 99663<br>
Failure messages were:<br>
--> Section 1 of test - got Error: Can't find variable: it FAILED! expected: a "read-only" error<br>
--> Section 2 of test - got Error: Can't find variable: it FAILED! expected: a "read-only" error<br>
--> Section 3 of test - got Error: Can't find variable: it FAILED! expected: a "read-only" error<br>
</tt><br>
1186 1187
<a name='failure66'></a><dd><b>Testcase <a target='other_window' href='./js1_3/regress/function-001-n.js'>js1_3/regress/function-001-n.js</a> failed</b> <a href='http://bugzilla.mozilla.org/show_bug.cgi?id=10278' target='other_window'>Bug Number 10278</a><br>
 [ <a href='#failure65'>Previous Failure</a> | <a href='#failure67'>Next Failure</a> | <a href='#tippy_top'>Top of Page</a> ]<br>
kdecker's avatar
kdecker committed
1188 1189 1190 1191 1192 1193 1194 1195
<tt>Expected exit code 3, got 0<br>
Testcase terminated with signal 0<br>
Complete testcase output was:<br>
--> BUGNUMBER: 10278<br>
--> function-001.js functions not separated by semicolons are errors in version 120 and higher<br>
--> eval("function f(){}function g(){}") = undefined FAILED! expected: error<br>
OK.<br>
</tt><br>
1196 1197
<a name='failure67'></a><dd><b>Testcase <a target='other_window' href='./js1_3/Script/function-001-n.js'>js1_3/Script/function-001-n.js</a> failed</b> <a href='http://bugzilla.mozilla.org/show_bug.cgi?id=10278' target='other_window'>Bug Number 10278</a><br>
 [ <a href='#failure66'>Previous Failure</a> | <a href='#failure68'>Next Failure</a> | <a href='#tippy_top'>Top of Page</a> ]<br>
kdecker's avatar
kdecker committed
1198 1199 1200 1201 1202 1203 1204 1205
<tt>Expected exit code 3, got 0<br>
Testcase terminated with signal 0<br>
Complete testcase output was:<br>
--> BUGNUMBER: 10278<br>
--> function-001.js functions not separated by semicolons are errors in version 120 and higher<br>
--> eval("function f(){}function g(){}") = undefined FAILED! expected: error<br>
OK.<br>
</tt><br>
1206 1207
<a name='failure68'></a><dd><b>Testcase <a target='other_window' href='./js1_3/Script/script-001.js'>js1_3/Script/script-001.js</a> failed</b> <br>
 [ <a href='#failure67'>Previous Failure</a> | <a href='#failure69'>Next Failure</a> | <a href='#tippy_top'>Top of Page</a> ]<br>
kdecker's avatar
kdecker committed
1208 1209 1210 1211
<tt>Expected exit code 0, got 3<br>
Testcase terminated with signal 0<br>
Complete testcase output was:<br>
--> script-001 NativeScript<br>
1212
Exception, line 134: ReferenceError: Can't find variable: Script<br>
kdecker's avatar
kdecker committed
1213
</tt><br>
1214 1215
<a name='failure69'></a><dd><b>Testcase <a target='other_window' href='./js1_4/Regress/function-002.js'>js1_4/Regress/function-002.js</a> failed</b> <a href='http://bugzilla.mozilla.org/show_bug.cgi?id=330462' target='other_window'>Bug Number 330462</a><br>
 [ <a href='#failure68'>Previous Failure</a> | <a href='#failure70'>Next Failure</a> | <a href='#tippy_top'>Top of Page</a> ]<br>
kdecker's avatar
kdecker committed
1216 1217 1218 1219
<tt><br>
Failure messages were:<br>
--> f1.toString() == dec1 = false FAILED! expected: true<br>
</tt><br>
1220 1221
<a name='failure70'></a><dd><b>Testcase <a target='other_window' href='./js1_4/Regress/function-003.js'>js1_4/Regress/function-003.js</a> failed</b> <a href='http://bugzilla.mozilla.org/show_bug.cgi?id=310514' target='other_window'>Bug Number 310514</a><br>
 [ <a href='#failure69'>Previous Failure</a> | <a href='#failure71'>Next Failure</a> | <a href='#tippy_top'>Top of Page</a> ]<br>
kdecker's avatar
kdecker committed
1222 1223
<tt><br>
Failure messages were:<br>
1224
--> StripSpaces(Array.prototype.concat.toString()).substring(0,17) = (InternalFunction FAILED! expected: functionconcat(){<br>
kdecker's avatar
kdecker committed
1225
</tt><br>
1226 1227
<a name='failure71'></a><dd><b>Testcase <a target='other_window' href='./js1_5/Exceptions/catchguard-001.js'>js1_5/Exceptions/catchguard-001.js</a> failed</b> <br>
 [ <a href='#failure70'>Previous Failure</a> | <a href='#failure72'>Next Failure</a> | <a href='#tippy_top'>Top of Page</a> ]<br>
1228
<tt>Expected exit code 0, got 3<br>
kdecker's avatar
kdecker committed
1229 1230
Testcase terminated with signal 0<br>
Complete testcase output was:<br>
1231
Exception, line 42: SyntaxError: Parse error<br>
kdecker's avatar
kdecker committed
1232
</tt><br>
1233 1234
<a name='failure72'></a><dd><b>Testcase <a target='other_window' href='./js1_5/Exceptions/catchguard-002.js'>js1_5/Exceptions/catchguard-002.js</a> failed</b> <br>
 [ <a href='#failure71'>Previous Failure</a> | <a href='#failure73'>Next Failure</a> | <a href='#tippy_top'>Top of Page</a> ]<br>
kdecker's avatar
kdecker committed
1235 1236 1237
<tt>Expected exit code 0, got 3<br>
Testcase terminated with signal 0<br>
Complete testcase output was:<br>
1238
Exception, line 42: SyntaxError: Parse error<br>
kdecker's avatar
kdecker committed
1239
</tt><br>
1240 1241
<a name='failure73'></a><dd><b>Testcase <a target='other_window' href='./js1_5/Exceptions/catchguard-003.js'>js1_5/Exceptions/catchguard-003.js</a> failed</b> <br>
 [ <a href='#failure72'>Previous Failure</a> | <a href='#failure74'>Next Failure</a> | <a href='#tippy_top'>Top of Page</a> ]<br>
kdecker's avatar
kdecker committed
1242 1243 1244
<tt>Expected exit code 0, got 3<br>
Testcase terminated with signal 0<br>
Complete testcase output was:<br>
1245
Exception, line 42: SyntaxError: Parse error<br>
kdecker's avatar
kdecker committed
1246
</tt><br>
1247 1248
<a name='failure74'></a><dd><b>Testcase <a target='other_window' href='./js1_5/Exceptions/errstack-001.js'>js1_5/Exceptions/errstack-001.js</a> failed</b> <br>
 [ <a href='#failure73'>Previous Failure</a> | <a href='#failure75'>Next Failure</a> | <a href='#tippy_top'>Top of Page</a> ]<br>
kdecker's avatar
kdecker committed
1249 1250 1251
<tt>Expected exit code 0, got 3<br>
Testcase terminated with signal 0<br>
Complete testcase output was:<br>