ChangeLog 1.38 MB
Newer Older
1
2
3
4
5
6
7
8
9
10
2013-08-16  Jer Noble  <jer.noble@apple.com>

        [Mac] [WK2] Some inspector tests intermittently asserts in InspectorOverlay::paint
        https://bugs.webkit.org/show_bug.cgi?id=105988

        Unreviewed gardening. Mark tests as flakey (crashing) in WK1 expectations as well as WK2.

        * platform/mac-wk2/TestExpectations:
        * platform/mac/TestExpectations:

11
12
13
14
15
16
17
18
19
20
21
22
2013-08-16  Allan Sandfeld Jensen  <allan.jensen@digia.com>

        [Qt] Kerning in fast font path breaks letter-spacing
        https://bugs.webkit.org/show_bug.cgi?id=119838

        Reviewed by Jocelyn Turcotte.

        Test that kerning does not break letter spacing.

        * fast/text/letter-spacing-kerned-expected.html: Added.
        * fast/text/letter-spacing-kerned.html: Added.

23
24
25
26
27
28
2013-08-16  Brent Fulgham  <bfulgham@apple.com>

        [Windows] Unreviewed gardening. Turn on a now-passing test.

        * platform/win/TestExpectations: Reactivate fast/text/split-text-crash.xhtml

29
30
31
32
33
34
35
36
37
2013-08-16  Brent Fulgham  <bfulgham@apple.com>

        [Windows] Enable previously-failing compositing/tiling/empty-to-tiled.html
        https://bugs.webkit.org/show_bug.cgi?id=119818

        Reviewed by Darin Adler.

        * platform/win/TestExpectations: Re-enable empty-to-tiled.html

38
39
40
41
42
43
44
2013-08-16  Tamas Czene <tczene@inf.u-szeged.hu>

        [Qt] Unreviewed gardening. Rebase js tests after r154127.

        * platform/qt/fast/js/constructor-length-expected.txt:
        * platform/qt/fast/js/global-constructors-attributes-expected.txt:

45
46
47
48
49
50
51
52
53
2013-08-16  Santosh Mahto  <santosh.ma@samsung.com>

        [EFL] fast/forms/datalist/input-list.html is failing

        Unreviewed EFL gardening. unskip LayoutTests/fast/forms/datalist/input-list.html test.

        * platform/efl/TestExpectations:
        * platform/efl/fast/forms/datalist/input-list-expected.txt: Added. 

54
55
56
57
58
59
60
61
62
63
64
65
66
67
2013-08-16  Andrei Parvu  <parvu@adobe.com>

        [CSS Masking] Add -webkit-mask-source-type property, with auto, alpha and luminance values
        https://bugs.webkit.org/show_bug.cgi?id=119614

        Added tests for the parsing of the -webkit-mask-source-type property

        Reviewed by Dirk Schulze.

        * fast/masking/parsing-mask-expected.txt:
        * fast/masking/parsing-mask-source-type-expected.txt: Added.
        * fast/masking/parsing-mask-source-type.html: Added.
        * fast/masking/parsing-mask.html:

68
69
70
71
72
73
74
75
76
77
78
79
80
81
82
83
84
85
86
87
2013-08-16  Simon Pena  <simon.pena@samsung.com>

        [GTK] Unreviewed gardening. Rebaseline after r154127 and add new baseline after r153647.

        * platform/gtk-wk1/TestExpectations:
        x-frame-options-deny-meta-tag-in-body.html fails in Release and
        Debug.
        * platform/gtk/TestExpectations: CSS Image filter is not enabled
        in GTK bots. Also remove entry for deleted test.
        * platform/gtk/fast/forms/search/search-size-with-decorations-expected.png: Added.
        * platform/gtk/fast/forms/search/search-size-with-decorations-expected.txt: Added.
        * platform/gtk/fast/js/constructor-length-expected.txt:
        Rebaselined after r154127.
        * platform/gtk/fast/js/global-constructors-attributes-dedicated-worker-expected.txt:
        ditto.
        * platform/gtk/fast/js/global-constructors-attributes-expected.txt:
        ditto.
        * platform/gtk/fast/js/global-constructors-attributes-shared-worker-expected.txt:
        ditto.

88
89
90
91
92
93
94
95
2013-08-16  Allan Sandfeld Jensen  <allan.jensen@digia.com>

        Reskip tests that times out.

        Unreviewed gardening.

        * platform/qt/TestExpectations:

96
97
98
99
100
101
102
2013-08-15  Brent Fulgham  <bfulgham@apple.com>

        [Windows] Unreviewed gardening. Correct some test expectations that now pass.

        * platform/win/editing/selection/caret-ltr-right-expected.txt:
        * platform/win/editing/selection/caret-rtl-2-left-expected.txt:

103
104
105
106
107
108
109
110
111
112
113
114
115
116
117
2013-08-15  Hans Muller  <hmuller@adobe.com>

        [CSS Shapes] Add support for shape-outside image values
        https://bugs.webkit.org/show_bug.cgi?id=119809

        Two tests to verify that the initial implementation of shape valued images is working
        for shape-outside.

        Reviewed by Alexandru Chiculita.

        * fast/shapes/shape-outside-floats/shape-outside-floats-image-001-expected.html: Added.
        * fast/shapes/shape-outside-floats/shape-outside-floats-image-001.html: Added.
        * fast/shapes/shape-outside-floats/shape-outside-floats-image-002-expected.html: Added.
        * fast/shapes/shape-outside-floats/shape-outside-floats-image-002.html: Added.

118
119
120
121
122
123
2013-08-15  Ryosuke Niwa  <rniwa@webkit.org>

        Revert that. The test had been fixed in r154148.

        * TestExpectations:

124
125
126
127
128
129
130
131
2013-08-15  Ryosuke Niwa  <rniwa@webkit.org>

        <https://webkit.org/b/119873> REGRESSION(r154057): platform/mac/accessibility/role-subrole-roledescription.html fails

        Add a test expectation.

        * TestExpectations:

132
133
134
135
136
137
138
139
140
141
142
143
144
2013-08-15  Sam White  <samuel_white@apple.com>

        AX: platform/mac/accessibility/role-subrole-roledescription.html is failing
        <https://webkit.org/b/119821>

        Updating our layout test now that accessibleElementById is able
        to fetch the math element correctly.

        Reviewed by Chris Fleizach.

        * platform/mac/accessibility/role-subrole-roledescription-expected.txt:
        * platform/mac/accessibility/role-subrole-roledescription.html:

145
146
147
148
149
150
151
152
153
154
155
2013-08-15  Simon Fraser  <simon.fraser@apple.com>

        <https://webkit.org/b/119871> Flash of garbage pixels when playing a show on Hulu

        Reviewed by Tim Horton.
        
        Test that would hit the newly added assertion in case of failure.
        Was unable to create a ref test that worked reliably.

        * compositing/contents-opaque/fixed-to-nonfixed.html: Added.

156
157
158
159
160
161
162
163
164
165
166
167
168
169
2013-08-15  Filip Pizlo  <fpizlo@apple.com>

        Remove a test that times out.
        
        Rubber stamped by Mark Hahnenberg.
        
        This test times out for me, every time. It tests code that has since been rewritten
        and has had new tests added to cover it. It's not clear that this test would be
        useful anymore even if we made it not timeout.

        * fast/js/array-sort-modifying-tostring-expected.txt: Removed.
        * fast/js/array-sort-modifying-tostring.html: Removed.
        * fast/js/script-tests/array-sort-modifying-tostring.js: Removed.

170
171
172
173
174
175
176
177
178
179
180
181
182
183
184
185
2013-08-15  Dirk Schulze  <krit@webkit.org>

        Implement CSS Image filter() function
        https://bugs.webkit.org/show_bug.cgi?id=119845

        Reviewed by Dean Jackson.

        Test parsing, style resolving, computed style and behavior of new
        CSS image function filter().

        * fast/filter-image/filter-image-expected.html: Added.
        * fast/filter-image/filter-image.html: Added.
        * fast/filter-image/parse-filter-image-expected.txt: Added.
        * fast/filter-image/parse-filter-image.html: Added.
        * fast/filter-image/resources/image.svg: Added.

186
187
188
189
190
191
2013-08-15  Filip Pizlo  <fpizlo@apple.com>

        Unreviewed, rebase the test now that we throw different exceptions.

        * fast/canvas/webgl/data-view-test-expected.txt:

192
193
194
195
196
197
198
199
200
201
202
203
204
205
206
207
208
209
210
211
212
213
214
215
216
217
218
219
220
221
222
223
224
225
226
227
228
229
230
231
232
233
234
235
236
237
238
239
240
241
242
243
244
245
246
247
248
249
250
251
2013-08-14  Filip Pizlo  <fpizlo@apple.com>

        Typed arrays should be rewritten
        https://bugs.webkit.org/show_bug.cgi?id=119064

        Reviewed by Oliver Hunt.

        * fast/canvas/webgl/array-set-invalid-arguments-expected.txt:
        * fast/canvas/webgl/array-set-out-of-bounds-expected.txt:
        * fast/canvas/webgl/array-unit-tests-expected.txt:
        * fast/canvas/webgl/array-unit-tests.html:
        * fast/canvas/webgl/data-view-crash-expected.txt:
        * fast/canvas/webgl/script-tests/arraybuffer-transfer-of-control.js:
        (checkView):
        * fast/dom/call-a-constructor-as-a-function-expected.txt:
        * fast/dom/call-a-constructor-as-a-function.html:
        * fast/js/constructor-length.html:
        * fast/js/global-constructors-attributes-dedicated-worker-expected.txt:
        * fast/js/global-constructors-attributes-expected.txt:
        * fast/js/global-constructors-attributes-shared-worker-expected.txt:
        * fast/js/regress/ArrayBuffer-Int8Array-alloc-expected.txt: Added.
        * fast/js/regress/ArrayBuffer-Int8Array-alloc-huge-long-lived-expected.txt: Added.
        * fast/js/regress/ArrayBuffer-Int8Array-alloc-huge-long-lived.html: Added.
        * fast/js/regress/ArrayBuffer-Int8Array-alloc-large-long-lived-expected.txt: Added.
        * fast/js/regress/ArrayBuffer-Int8Array-alloc-large-long-lived.html: Added.
        * fast/js/regress/ArrayBuffer-Int8Array-alloc-long-lived-buffer-expected.txt: Added.
        * fast/js/regress/ArrayBuffer-Int8Array-alloc-long-lived-buffer.html: Added.
        * fast/js/regress/ArrayBuffer-Int8Array-alloc-long-lived-expected.txt: Added.
        * fast/js/regress/ArrayBuffer-Int8Array-alloc-long-lived.html: Added.
        * fast/js/regress/ArrayBuffer-Int8Array-alloc.html: Added.
        * fast/js/regress/Int32Array-Int8Array-view-alloc-expected.txt: Added.
        * fast/js/regress/Int32Array-Int8Array-view-alloc.html: Added.
        * fast/js/regress/Int32Array-alloc-expected.txt: Added.
        * fast/js/regress/Int32Array-alloc-huge-expected.txt: Added.
        * fast/js/regress/Int32Array-alloc-huge-long-lived-expected.txt: Added.
        * fast/js/regress/Int32Array-alloc-huge-long-lived.html: Added.
        * fast/js/regress/Int32Array-alloc-huge.html: Added.
        * fast/js/regress/Int32Array-alloc-large-expected.txt: Added.
        * fast/js/regress/Int32Array-alloc-large-long-lived-expected.txt: Added.
        * fast/js/regress/Int32Array-alloc-large-long-lived.html: Added.
        * fast/js/regress/Int32Array-alloc-large.html: Added.
        * fast/js/regress/Int32Array-alloc-long-lived-expected.txt: Added.
        * fast/js/regress/Int32Array-alloc-long-lived.html: Added.
        * fast/js/regress/Int32Array-alloc.html: Added.
        * fast/js/regress/script-tests/ArrayBuffer-Int8Array-alloc-huge-long-lived.js: Added.
        * fast/js/regress/script-tests/ArrayBuffer-Int8Array-alloc-large-long-lived.js: Added.
        * fast/js/regress/script-tests/ArrayBuffer-Int8Array-alloc-long-lived-buffer.js: Added.
        * fast/js/regress/script-tests/ArrayBuffer-Int8Array-alloc-long-lived.js: Added.
        * fast/js/regress/script-tests/ArrayBuffer-Int8Array-alloc.js: Added.
        * fast/js/regress/script-tests/Int32Array-Int8Array-view-alloc.js: Added.
        * fast/js/regress/script-tests/Int32Array-alloc-huge-long-lived.js: Added.
        * fast/js/regress/script-tests/Int32Array-alloc-huge.js: Added.
        * fast/js/regress/script-tests/Int32Array-alloc-large-long-lived.js: Added.
        * fast/js/regress/script-tests/Int32Array-alloc-large.js: Added.
        * fast/js/regress/script-tests/Int32Array-alloc-long-lived.js: Added.
        * fast/js/regress/script-tests/Int32Array-alloc.js: Added.
        * platform/mac/fast/js/constructor-length-expected.txt:
        * webgl/resources/webgl_test_files/conformance/typedarrays/array-unit-tests.html:
        * webgl/resources/webgl_test_files/conformance/typedarrays/data-view-test.html:

252
253
254
255
256
257
258
259
260
261
262
263
264
265
2013-08-15  Oliver Hunt  <oliver@apple.com>

        <https://webkit.org/b/119830> Assigning to a readonly global results in DFG byte code parse failure

        Reviewed by Filip Pizlo.

        Add a test

        * fast/js/dfg-put-to-readonly-property-expected.txt: Added.
        * fast/js/dfg-put-to-readonly-property.html: Added.
        * fast/js/script-tests/dfg-put-to-readonly-property.js: Added.
        (foo):
        (bar):

266
267
268
269
270
271
272
273
274
2013-08-15  Mario Sanchez Prada  <mario.prada@samsung.com>

        [GTK] Unreviewed gardening. Move Mac specific expectation for
        accessibility test to the cross platform directory, as the result
        it's shared with GTK and EFL ports.

        * accessibility/heading-title-includes-links-expected.txt: Renamed
        from LayoutTests/platform/mac/accessibility/heading-title-includes-links-expected.txt.

275
276
277
278
279
280
281
282
283
284
285
286
287
288
289
290
291
292
293
294
295
296
297
298
299
300
301
302
303
304
305
306
307
308
309
310
311
312
313
314
315
316
317
318
319
320
321
322
323
324
325
326
327
328
329
330
331
332
333
334
335
336
337
338
339
340
341
342
343
344
345
346
347
348
349
350
351
352
353
354
355
356
357
358
359
360
361
362
363
364
2013-08-15  Allan Sandfeld Jensen  <allan.jensen@digia.com>

        Empty qt-5.0 expectations into qt expectations

        Unreviewed gardening.

        * platform/qt-5.0/TestExpectations:
        * platform/qt-5.0/editing/selection/editable-html-element-expected.txt: Removed.
        * platform/qt-5.0/editing/selection/extend-by-word-001-expected.txt: Removed.
        * platform/qt-5.0/editing/selection/vertical-rl-ltr-extend-line-backward-wrap-expected.txt: Removed.
        * platform/qt-5.0/editing/selection/vertical-rl-ltr-extend-line-forward-wrap-expected.txt: Removed.
        * platform/qt-5.0/fast/dom/Orientation/create-event-orientationchange-expected.txt: Removed.
        * platform/qt-5.0/fast/dom/Window/window-properties-device-orientation-expected.txt: Removed.
        * platform/qt-5.0/fast/events/onload-re-entry-expected.txt: Removed.
        * platform/qt-5.0/fast/forms/input-disabled-color-expected.png: Removed.
        * platform/qt-5.0/fast/forms/input-disabled-color-expected.txt: Removed.
        * platform/qt-5.0/fast/forms/menulist-separator-painting-expected.png: Removed.
        * platform/qt-5.0/fast/forms/menulist-separator-painting-expected.txt: Removed.
        * platform/qt-5.0/fast/forms/select-background-none-expected.png: Removed.
        * platform/qt-5.0/fast/forms/select-background-none-expected.txt: Removed.
        * platform/qt-5.0/fast/images/embed-image-expected.txt: Removed.
        * platform/qt-5.0/fast/images/object-image-expected.txt: Removed.
        * platform/qt-5.0/fast/text/backslash-to-yen-sign-expected.txt: Removed.
        * platform/qt-5.0/fast/text/basic/003-expected.png: Removed.
        * platform/qt-5.0/fast/text/basic/003-expected.txt: Removed.
        * platform/qt-5.0/fast/text/fallback-traits-fixup-expected.txt: Removed.
        * platform/qt-5.0/fast/text/international/hindi-whitespace-expected.txt: Removed.
        * platform/qt-5.0/fast/text/international/text-spliced-font-expected.txt: Removed.
        * platform/qt-5.0/fast/text/letter-spacing-negative-opacity-expected.png: Removed.
        * platform/qt-5.0/fast/text/letter-spacing-negative-opacity-expected.txt: Removed.
        * platform/qt-5.0/fast/text/soft-hyphen-3-expected.txt: Removed.
        * platform/qt-5.0/http/tests/misc/location-replace-crossdomain-expected.png: Removed.
        * platform/qt-5.0/http/tests/misc/location-replace-crossdomain-expected.txt: Removed.
        * platform/qt-5.0/svg/W3C-SVG-1.1-SE/color-prop-05-t-expected.png: Removed.
        * platform/qt-5.0/svg/W3C-SVG-1.1-SE/filters-image-03-f-expected.png: Removed.
        * platform/qt-5.0/svg/W3C-SVG-1.1-SE/pservers-pattern-03-f-expected.png: Removed.
        * platform/qt-5.0/svg/W3C-SVG-1.1-SE/struct-use-14-f-expected.png: Removed.
        * platform/qt-5.0/svg/W3C-SVG-1.1-SE/svgdom-over-01-f-expected.png: Removed.
        * platform/qt-5.0/svg/as-image/img-preserveAspectRatio-support-1-expected.png: Removed.
        * platform/qt-5.0/svg/as-image/img-preserveAspectRatio-support-1-expected.txt: Removed.
        * platform/qt-5.0/svg/as-object/object-box-sizing-no-width-height-expected.png: Removed.
        * platform/qt-5.0/svg/as-object/object-box-sizing-no-width-height-expected.txt: Removed.
        * platform/qt-5.0/svg/batik/text/longTextOnPath-expected.png: Removed.
        * platform/qt-5.0/svg/batik/text/longTextOnPath-expected.txt: Removed.
        * platform/qt-5.0/svg/carto.net/tabgroup-expected.txt: Removed.
        * platform/qt-5.0/svg/foreignObject/text-tref-02-b-expected.png: Removed.
        * platform/qt-5.0/svg/transforms/text-with-pattern-with-svg-transform-expected.png: Removed.
        * platform/qt-5.0/svg/transforms/text-with-pattern-with-svg-transform-expected.txt: Removed.
        * platform/qt/TestExpectations:
        * platform/qt/editing/execCommand/findString-diacriticals-expected.txt: Renamed from LayoutTests/platform/qt-5.0/editing/execCommand/findString-diacriticals-expected.txt.
        * platform/qt/editing/selection/click-left-of-rtl-wrapping-text-expected.txt: Renamed from LayoutTests/platform/qt-5.0/editing/selection/click-left-of-rtl-wrapping-text-expected.txt.
        * platform/qt/fast/events/onload-re-entry-expected.png: Renamed from LayoutTests/platform/qt-5.0/fast/events/onload-re-entry-expected.png.
        * platform/qt/fast/events/onload-re-entry-expected.txt:
        * platform/qt/fast/events/touch/touch-slider-expected.txt: Renamed from LayoutTests/platform/qt-5.0/fast/events/touch/touch-slider-expected.txt.
        * platform/qt/fast/events/touch/touch-slider-no-js-touch-listener-expected.txt: Renamed from LayoutTests/platform/qt-5.0/fast/events/touch/touch-slider-no-js-touch-listener-expected.txt.
        * platform/qt/fast/forms/input-disabled-color-expected.png:
        * platform/qt/fast/forms/input-disabled-color-expected.txt:
        * platform/qt/fast/forms/menulist-separator-painting-expected.png:
        * platform/qt/fast/forms/menulist-separator-painting-expected.txt:
        * platform/qt/fast/forms/select-background-none-expected.png:
        * platform/qt/fast/forms/select-background-none-expected.txt:
        * platform/qt/fast/images/embed-image-expected.txt:
        * platform/qt/fast/images/object-image-expected.txt:
        * platform/qt/fast/text/basic/003-expected.png:
        * platform/qt/fast/text/international/text-spliced-font-expected.png: Renamed from LayoutTests/platform/qt-5.0/fast/text/international/text-spliced-font-expected.png.
        * platform/qt/fast/text/soft-hyphen-3-expected.txt:
        * platform/qt/http/tests/cookies/double-quoted-value-with-semi-colon-expected.txt: Renamed from LayoutTests/platform/qt-5.0/http/tests/cookies/double-quoted-value-with-semi-colon-expected.txt.
        * platform/qt/http/tests/misc/location-replace-crossdomain-expected.png:
        * platform/qt/http/tests/misc/location-replace-crossdomain-expected.txt:
        * platform/qt/http/tests/security/xss-DENIED-xsl-external-entity-redirect-expected.txt: Renamed from LayoutTests/platform/qt-5.0/http/tests/security/xss-DENIED-xsl-external-entity-redirect-expected.txt.
        * platform/qt/http/tests/xmlhttprequest/methods-expected.txt: Renamed from LayoutTests/platform/qt-5.0/http/tests/xmlhttprequest/methods-expected.txt.
        * platform/qt/http/tests/xmlhttprequest/workers/methods-async-expected.txt: Renamed from LayoutTests/platform/qt-5.0/http/tests/xmlhttprequest/workers/methods-async-expected.txt.
        * platform/qt/http/tests/xmlhttprequest/workers/methods-expected.txt: Renamed from LayoutTests/platform/qt-5.0/http/tests/xmlhttprequest/workers/methods-expected.txt.
        * platform/qt/http/tests/xmlhttprequest/workers/shared-worker-methods-async-expected.txt: Renamed from LayoutTests/platform/qt-5.0/http/tests/xmlhttprequest/workers/shared-worker-methods-async-expected.txt.
        * platform/qt/svg/W3C-SVG-1.1-SE/color-prop-05-t-expected.png:
        * platform/qt/svg/W3C-SVG-1.1-SE/filters-image-03-f-expected.png:
        * platform/qt/svg/W3C-SVG-1.1-SE/pservers-pattern-03-f-expected.png:
        * platform/qt/svg/W3C-SVG-1.1-SE/struct-use-14-f-expected.png:
        * platform/qt/svg/W3C-SVG-1.1-SE/svgdom-over-01-f-expected.png:
        * platform/qt/svg/as-image/img-preserveAspectRatio-support-1-expected.png:
        * platform/qt/svg/as-object/object-box-sizing-no-width-height-expected.png:
        * platform/qt/svg/as-object/object-box-sizing-no-width-height-expected.txt:
        * platform/qt/svg/batik/text/longTextOnPath-expected.png:
        * platform/qt/svg/batik/text/longTextOnPath-expected.txt:
        * platform/qt/svg/carto.net/tabgroup-expected.png: Renamed from LayoutTests/platform/qt-5.0/svg/carto.net/tabgroup-expected.png.
        * platform/qt/svg/carto.net/tabgroup-expected.txt:
        * platform/qt/svg/foreignObject/text-tref-02-b-expected.png:
        * platform/qt/svg/transforms/text-with-pattern-with-svg-transform-expected.png:
        * platform/qt/svg/transforms/text-with-pattern-with-svg-transform-expected.txt:

365
366
367
368
369
370
371
372
373
374
375
376
377
378
379
2013-08-15  Simon Pena  <simon.pena@samsung.com>

        [GTK] Unreviewed gardening. Update test expectations.

        * platform/gtk-wk1/TestExpectations: Unskip tests no longer failing.
        * platform/gtk-wk1/loader/go-back-cached-main-resource-expected.txt:
        Rebaseline after r153852.
        * platform/gtk/TestExpectations:
        * platform/gtk/fast/regions/region-dynamic-after-before-expected.txt:
        Rebaseline after r154072.
        * platform/gtk/fast/regions/region-generated-content-before-after-expected.txt:
        Rebaseline after r154072.
        * platform/gtk/security/block-test-no-port-expected.txt:
        Rebaseline after r153852.

380
381
382
383
384
385
386
387
388
389
390
391
2013-08-15  Rob Buis  <rwlbuis@webkit.org>

        ASSERTION FAILED: !m_adoptionIsRequired in void WebCore::TreeShared<NodeType>::ref()
        https://bugs.webkit.org/show_bug.cgi?id=116979

        Reviewed by Antti Koivisto.

        Add testcase from bug with small adjustments.

        * svg/custom/tref-with-progress-tag-setpseudo-assert-expected.txt: Added.
        * svg/custom/tref-with-progress-tag-setpseudo-assert.html: Added.

392
393
394
395
396
397
398
399
2013-08-15  Simon Pena  <simon.pena@samsung.com>

        [GTK] Unreviewed gardening. Skip failing test.

        * platform/gtk-wk1/TestExpectations:
        http/tests/loading/unfinished-main-resource-back-to-cached-page-callbacks.html
        is failing.

400
401
402
403
404
405
406
407
408
409
410
2013-08-15  Allan Sandfeld Jensen  <allan.jensen@digia.com>

        [Qt] fast/canvas/canvas-blending-transforms.html test fails on x32 after r153941.
        https://bugs.webkit.org/show_bug.cgi?id=119792

        Unreviewed gardening.

        Speculative unskip after r154095.

        * platform/qt/TestExpectations:

411
412
413
414
415
416
417
418
419
420
421
2013-08-15  Allan Sandfeld Jensen  <allan.jensen@digia.com>

        REGRESSION(r148790) Made 7 tests fail on x86 32bit
        https://bugs.webkit.org/show_bug.cgi?id=114913

        Reviewed by Filip Pizlo.

        Unskip the five tests now passsing again.

        * platform/qt/TestExpectations:

422
423
424
425
426
427
2013-08-15  Simon Pena  <simon.pena@samsung.com>

        [GTK] Unreviewed gardening. Rebaseline after r154057.

        * platform/gtk/fast/js/dom-static-property-for-in-iteration-expected.txt:

428
429
430
431
432
433
434
435
436
437
2013-08-15  Ryuan Choi  <ryuan.choi@samsung.com>

        [EFL] Unreviwed gardening.

        Skipped some failures.

        * platform/efl-wk2/TestExpectations:
        * platform/efl/TestExpectations:
        * platform/efl/fast/forms/datalist/input-list-expected.txt: Removed.

438
439
440
441
442
443
444
445
446
447
448
449
450
451
452
453
2013-08-15  Simon Pena  <simon.pena@samsung.com>

        [GTK] Unreviewed gardening. Rebaseline after r154072.

        * platform/gtk/fast/regions/autoheight-regions-mark-expected.txt:
        * platform/gtk/fast/regions/overflow-in-uniform-regions-dynamic-expected.txt:
        * platform/gtk/fast/regions/overflow-in-variable-width-regions-expected.txt:
        * platform/gtk/fast/regions/overflow-moving-below-floats-in-variable-width-regions-expected.txt:
        * platform/gtk/fast/regions/overflow-not-moving-below-floats-in-variable-width-regions-expected.txt:
        * platform/gtk/fast/regions/overflow-rtl-in-variable-width-regions-expected.txt:
        * platform/gtk/fast/regions/overflow-size-change-in-variable-width-regions-expected.txt:
        * platform/gtk/fast/repaint/japanese-rl-selection-repaint-in-regions-expected.txt:
        * platform/gtk/fast/repaint/line-flow-with-floats-in-regions-expected.txt:
        * platform/gtk/fast/repaint/overflow-flipped-writing-mode-block-in-regions-expected.txt:
        * platform/gtk/fast/repaint/region-painting-via-layout-expected.txt:

454
455
456
457
458
459
460
461
462
463
464
465
466
467
468
469
470
471
472
473
474
475
476
2013-08-15  Tamas Czene <tczene@inf.u-szeged.hu>

        [Qt] Unreviwed gardening. Rebase fast tests after r154072.

        * platform/qt-5.0-wk2/fast/repaint/region-painting-via-layout-expected.txt: Removed.
        * platform/qt/fast/regions/autoheight-regions-mark-expected.txt:
        * platform/qt/fast/regions/overflow-in-uniform-regions-dynamic-expected.png:
        * platform/qt/fast/regions/overflow-in-uniform-regions-dynamic-expected.txt:
        * platform/qt/fast/regions/overflow-in-variable-width-regions-expected.png:
        * platform/qt/fast/regions/overflow-in-variable-width-regions-expected.txt:
        * platform/qt/fast/regions/overflow-moving-below-floats-in-variable-width-regions-expected.png:
        * platform/qt/fast/regions/overflow-moving-below-floats-in-variable-width-regions-expected.txt:
        * platform/qt/fast/regions/overflow-not-moving-below-floats-in-variable-width-regions-expected.png:
        * platform/qt/fast/regions/overflow-not-moving-below-floats-in-variable-width-regions-expected.txt:
        * platform/qt/fast/regions/overflow-rtl-in-variable-width-regions-expected.png:
        * platform/qt/fast/regions/overflow-rtl-in-variable-width-regions-expected.txt:
        * platform/qt/fast/regions/overflow-size-change-in-variable-width-regions-expected.png:
        * platform/qt/fast/regions/overflow-size-change-in-variable-width-regions-expected.txt:
        * platform/qt/fast/repaint/line-flow-with-floats-in-regions-expected.png:
        * platform/qt/fast/repaint/line-flow-with-floats-in-regions-expected.txt:
        * platform/qt/fast/repaint/overflow-flipped-writing-mode-block-in-regions-expected.txt:
        * platform/qt/fast/repaint/region-painting-via-layout-expected.txt:

477
478
479
480
481
482
483
484
485
486
2013-08-14  Alexey Proskuryakov  <ap@apple.com>

        Don't copy js-test-pre in cookies-test-pre
        https://bugs.webkit.org/show_bug.cgi?id=119802

        Reviewed by Sam Weinig.

        * http/tests/cookies/resources/cookies-test-post.js:
        * http/tests/cookies/resources/cookies-test-pre.js:

487
488
489
490
491
492
493
494
495
496
497
498
499
500
501
502
503
504
505
506
507
508
509
510
511
512
513
514
515
516
517
518
519
520
521
522
523
2013-08-14  Ryuan Choi  <ryuan.choi@samsung.com>

        <https://webkit.org/b/119786> [EFL] decoration of search type is different from other platforms

        Reviewed by Gyuyoung Kim.

        Rebaseline related to input search field.

        * platform/efl/fast/css/input-search-padding-expected.png:
        * platform/efl/fast/css/input-search-padding-expected.txt:
        * platform/efl/fast/css/text-input-with-webkit-border-radius-expected.png:
        * platform/efl/fast/css/text-input-with-webkit-border-radius-expected.txt:
        * platform/efl/fast/css/text-overflow-input-expected.png:
        * platform/efl/fast/css/text-overflow-input-expected.txt:
        * platform/efl/fast/forms/box-shadow-override-expected.png:
        * platform/efl/fast/forms/box-shadow-override-expected.txt:
        * platform/efl/fast/forms/control-restrict-line-height-expected.png:
        * platform/efl/fast/forms/control-restrict-line-height-expected.txt:
        * platform/efl/fast/forms/input-appearance-height-expected.png:
        * platform/efl/fast/forms/input-appearance-height-expected.txt:
        * platform/efl/fast/forms/placeholder-position-expected.png:
        * platform/efl/fast/forms/placeholder-position-expected.txt:
        * platform/efl/fast/forms/placeholder-pseudo-style-expected.png:
        * platform/efl/fast/forms/placeholder-pseudo-style-expected.txt:
        * platform/efl/fast/forms/search-cancel-button-style-sharing-expected.png:
        * platform/efl/fast/forms/search-cancel-button-style-sharing-expected.txt:
        * platform/efl/fast/forms/search-display-none-cancel-button-expected.png:
        * platform/efl/fast/forms/search-display-none-cancel-button-expected.txt:
        * platform/efl/fast/forms/search-rtl-expected.png:
        * platform/efl/fast/forms/search-rtl-expected.txt:
        * platform/efl/fast/forms/search-vertical-alignment-expected.png:
        * platform/efl/fast/forms/search-vertical-alignment-expected.txt:
        * platform/efl/fast/forms/searchfield-heights-expected.png:
        * platform/efl/fast/forms/searchfield-heights-expected.txt:
        * platform/efl/fast/repaint/search-field-cancel-expected.png:
        * platform/efl/fast/repaint/search-field-cancel-expected.txt:

524
525
526
527
528
529
530
531
532
533
534
2013-08-14  Chris Fleizach  <cfleizach@apple.com>

        <https://webkit.org/b/119817> AX: Integrate layout tests from overflow bounding boxes are way too big; prevents VoiceOver taps from activating the right elements

        Reviewed by Simon Fraser.

        Add a layout test to ensure that transformed elements do not get offset twice when calculating their accessibility bounds.

        * accessibility/transformed-bounds-expected.txt: Added.
        * accessibility/transformed-bounds.html: Added.

535
536
537
538
539
540
541
542
543
544
545
546
547
548
549
2013-08-14  Hans Muller  <hmuller@adobe.com>

        [CSS Exclusions] Minimal support for using an image to define a shape
        https://bugs.webkit.org/show_bug.cgi?id=116643

        Two tests to verify that the initial implementation of shape valued images is working
        for shape-inside.

        Reviewed by Alexandru Chiculita.

        * fast/exclusions/shape-inside/shape-inside-image-001-expected.html: Added.
        * fast/exclusions/shape-inside/shape-inside-image-001.html: Added.
        * fast/exclusions/shape-inside/shape-inside-image-002-expected.html: Added.
        * fast/exclusions/shape-inside/shape-inside-image-002.html: Added.

550
551
552
553
554
555
556
557
2013-08-14  Brent Fulgham  <bfulgham@apple.com>

        [Windows] Unreviewed build gardening.

        * platform/win/TestExpectations: Clean up a lint warning, and reactivate four tiling tests
        that pass and had been turned off previously.


558
559
560
561
562
563
564
565
566
567
568
569
570
571
572
573
574
575
576
577
578
579
580
581
582
583
584
585
586
587
588
589
590
591
592
593
594
595
596
597
2013-08-14  Alexandru Chiculita  <achicu@adobe.com>

        [CSS Regions] RenderRegions should have a RenderLayer+Backing when they contain a Composited RenderLayer
        https://bugs.webkit.org/show_bug.cgi?id=117365

        Reviewed by David Hyatt.

        Added new tests for cases when CSS Regions are promoted to RenderLayers because
        they contain elements that might need to become composited.

        * fast/regions/layers/dynamic-layer-added-with-no-layout-expected.png: Added.
        * fast/regions/layers/dynamic-layer-added-with-no-layout-expected.txt: Added.
        * fast/regions/layers/dynamic-layer-added-with-no-layout.html: Added.
        * fast/regions/layers/dynamic-layer-removed-with-no-layout-expected.png: Added.
        * fast/regions/layers/dynamic-layer-removed-with-no-layout-expected.txt: Added.
        * fast/regions/layers/dynamic-layer-removed-with-no-layout.html: Added.
        * fast/regions/layers/float-region-promoted-to-layer-expected.html: Added.
        * fast/regions/layers/float-region-promoted-to-layer.html: Added.
        * fast/regions/layers/regions-promoted-to-layers-expected.txt: Added.
        * fast/regions/layers/regions-promoted-to-layers-horizontal-bt-expected.txt: Added.
        * fast/regions/layers/regions-promoted-to-layers-horizontal-bt.html: Added.
        * fast/regions/layers/regions-promoted-to-layers-vertical-lr-expected.txt: Added.
        * fast/regions/layers/regions-promoted-to-layers-vertical-lr.html: Added.
        * fast/regions/layers/regions-promoted-to-layers-vertical-rl-expected.txt: Added.
        * fast/regions/layers/regions-promoted-to-layers-vertical-rl.html: Added.
        * fast/regions/layers/regions-promoted-to-layers.html: Added.

        Updated existing tests that now have CSS Regions that require a RenderLayer.
        * fast/regions/autoheight-regions-mark-expected.txt:
        * fast/repaint/overflow-flipped-writing-mode-block-in-regions-expected.txt:
        * fast/repaint/region-painting-via-layout-expected.txt:
        * platform/mac/fast/regions/overflow-in-uniform-regions-dynamic-expected.txt:
        * platform/mac/fast/regions/overflow-in-variable-width-regions-expected.txt:
        * platform/mac/fast/regions/overflow-moving-below-floats-in-variable-width-regions-expected.txt:
        * platform/mac/fast/regions/overflow-not-moving-below-floats-in-variable-width-regions-expected.txt:
        * platform/mac/fast/regions/overflow-rtl-in-variable-width-regions-expected.txt:
        * platform/mac/fast/regions/overflow-size-change-in-variable-width-regions-expected.txt:
        * platform/mac/fast/repaint/japanese-rl-selection-repaint-in-regions-expected.txt:
        * platform/mac/fast/repaint/line-flow-with-floats-in-regions-expected.txt:

598
599
600
601
602
603
604
605
606
607
2013-08-14  Andreas Kling  <akling@apple.com>

        <http://webkit.org/b/119520> REGRESSION(154062): fast/repaint/caret-jump-between-nodes.html flakes on bots.

        Unreviewed. This isn't working out. I can't get it to blink the caret a consistent number of times.
        Removing the test for now to stop making bots red.

        * fast/repaint/caret-jump-between-nodes-expected.txt: Removed.
        * fast/repaint/caret-jump-between-nodes.html: Removed.

608
609
610
611
612
613
614
615
616
617
618
619
2013-08-14  Rob Buis  <rwlbuis@webkit.org>

        Assertion failure in RenderObject::drawLineForBoxSide
        https://bugs.webkit.org/show_bug.cgi?id=108187

        Reviewed by David Hyatt.

        Add testcase from bug with small adjustments.

        * fast/css/outline-negative-expected.txt: Added.
        * fast/css/outline-negative.html: Added.

620
621
622
623
624
625
626
627
628
629
630
631
632
633
2013-08-14  Andreas Kling  <akling@apple.com>

        REGRESSION(r153815): fast/repaint/caret-jump-between-nodes.html sucks.
        <http://webkit.org/b/119520>

        Unreviewed, remove the description text from this repaint test in an attempt
        to get consistent cross-platform results.

        * fast/repaint/caret-jump-between-nodes-expected.txt:
        * fast/repaint/caret-jump-between-nodes.html:
        * platform/gtk/fast/repaint/caret-jump-between-nodes-expected.txt: Removed.
        * platform/qt-5.0-wk2/fast/repaint/caret-jump-between-nodes-expected.txt: Removed.
        * platform/qt/fast/repaint/caret-jump-between-nodes-expected.txt: Removed.

634
635
636
637
638
639
640
641
642
643
644
2013-08-13  Chris Fleizach  <cfleizach@apple.com>

        AX: Headings not longer have an AXTitle if they have a link as the only child
        https://bugs.webkit.org/show_bug.cgi?id=119699

        Reviewed by Anders Carlsson.

        * accessibility/heading-title-includes-links.html: Added.
        * platform/mac/accessibility/heading-title-includes-links-expected.txt: Added.
        * platform/mac/accessibility/internal-link-anchors2-expected.txt:

645
646
647
648
649
650
651
652
653
654
655
656
2013-08-14  Christophe Dumez  <ch.dumez@sisa.samsung.com>

        Move id attribute to parent Element interface
        https://bugs.webkit.org/show_bug.cgi?id=119706

        Reviewed by Ryosuke Niwa.

        Rebaseline fast/js/dom-static-property-for-in-iteration.html as
        the order has changed.

        * fast/js/dom-static-property-for-in-iteration-expected.txt:

657
658
659
660
661
662
663
664
665
666
667
668
669
670
671
672
673
674
675
676
677
678
679
680
2013-08-14  Arpita Bahuguna  <a.bah@samsung.com>

        createAttribute/setAttributeNode does not properly normalize case
        https://bugs.webkit.org/show_bug.cgi?id=90341

        Reviewed by Darin Adler.

        * fast/dom/Element/setAttributeNode-case-insensitivity.html: Added.
        * fast/dom/Element/setAttributeNode-case-insensitivity-expected.txt: Added.
        Testcase for verifying that setAttributeNode() checks against existing
        attributes in a case insensitive manner. It updates the value of an
        existing attribute (in lower case) with that of the one set using
        setAttributeNode() (in upper case).
        The test also verifies the behavior of attributes when specified with
        namespace and prefix.

        * fast/dom/Element/setAttributeNode-case-insensitivity-xhtml-expected.txt: Added.
        * fast/dom/Element/setAttributeNode-case-insensitivity-xhtml.xhtml: Added.
        Testcase added for verifying that the default behavior for xhtml documents
        does not change with this fix.
        For xhtml documents, attributes can be added case sensitively. This testcase
        verifies that two attributes with the same name but different case are
        allowed for an xhtml document.

681
682
683
684
685
686
687
688
689
2013-08-14  Benjamin Dupont   <bdupont@nds.com>

        [Qt] Activate visibility API layout tests
        https://bugs.webkit.org/show_bug.cgi?id=119790

        Reviewed by Allan Sandfeld Jensen.

        * platform/qt/TestExpectations:

690
691
692
693
694
695
696
697
698
699
700
701
702
703
704
705
706
707
708
709
710
711
712
2013-08-14  Rob Buis  <rwlbuis@webkit.org>

        ASSERTION FAILED: resultAnimationElement->m_animatedType in WebCore::SVGAnimateElement::calculateAnimatedValue
        https://bugs.webkit.org/show_bug.cgi?id=119748

        Reviewed by Dirk Schulze.

        Test that using animateTransform with attributeType="CSS" will cause no animateTransform animation, and
        attributeType="auto" will act as "XML".

        * svg/animations/animateTransform-translate-attributetype-auto-expected.txt: Added.
        * svg/animations/animateTransform-translate-attributetype-auto.html: Added.
        * svg/animations/animateTransform-translate-invalid-attributetype-expected.txt: Added.
        * svg/animations/animateTransform-translate-invalid-attributetype.html: Added.
        * svg/animations/script-tests/animateTransform-translate-attributetype-auto.js: Added.
        (sample1):
        (sample2):
        (sample3):
        (executeTest):
        * svg/animations/script-tests/animateTransform-translate-invalid-attributetype.js: Added.
        (sample):
        (executeTest):

713
714
715
716
717
718
2013-08-14  Gabor Abraham  <abrhm@inf.u-szeged.hu>

        [Qt] Unreviewd gardening. Skipping failing tests on x86.

        * platform/qt/TestExpectations:

719
720
721
722
723
724
725
726
727
728
729
730
731
732
733
734
735
736
737
738
739
740
741
742
743
744
745
746
2013-08-13  Sergio Villar Senin  <svillar@igalia.com>

        [CSS Grid Layout] Align our grid-line handling with the updated specification
        https://bugs.webkit.org/show_bug.cgi?id=113546

        Reviewed by Andreas Kling.

        From Blink r148091 by <jchaffraix@chromium.org>

        Added a couple of new tests to cover the cases of grid resolutions
        using negative integers. Negative integers must resolve against
        the grid-{column|row}-end of the explicit grid.

        * fast/css-grid-layout/grid-auto-flow-resolution-expected.txt:
        * fast/css-grid-layout/grid-auto-flow-resolution.html:
        * fast/css-grid-layout/grid-item-negative-integer-explicit-grid-resolution-expected.txt: Added.
        * fast/css-grid-layout/grid-item-negative-integer-explicit-grid-resolution.html: Added.
        * fast/css-grid-layout/grid-item-spanning-resolution-expected.txt:
        * fast/css-grid-layout/grid-item-spanning-resolution.html:
        * fast/css-grid-layout/resources/grid.css:
        (.autoLastRowAutoLastColumn):
        (.autoSecondRowAutoFirstColumn):
        (.firstRowBothColumn):
        (.secondRowBothColumn):
        (.bothRowFirstColumn):
        (.bothRowSecondColumn):
        (.bothRowBothColumn):

747
748
749
750
751
752
753
754
755
756
757
758
759
760
761
762
2013-08-13  Gyuyoung Kim  <gyuyoung.kim@samsung.com>

        The length of scheme is at least five characters even when the scheme has 'web+' prefix
        https://bugs.webkit.org/show_bug.cgi?id=119779

        Reviewed by Ryosuke Niwa.

        Add a test case to check if the length of 'web+' is five characters at least.

        * fast/dom/register-protocol-handler-expected.txt:
        * fast/dom/register-protocol-handler.html:
        * fast/dom/unregister-protocol-handler-expected.txt:
        * fast/dom/unregister-protocol-handler.html:
        * platform/efl/fast/dom/register-protocol-handler-expected.txt:
        * platform/efl/fast/dom/unregister-protocol-handler-expected.txt:

763
764
765
766
767
768
769
770
771
772
2013-08-13  Ryosuke Niwa  <rniwa@webkit.org>

        REGRESSION(r150187): Safari fails to render allrecipe.com comment popups
        https://bugs.webkit.org/show_bug.cgi?id=119780

        Reviewed by Benjamin Poulain.

        * fast/selectors/querySelector-id-with-multiple-elements-with-same-id-expected.txt: Added.
        * fast/selectors/querySelector-id-with-multiple-elements-with-same-id.html: Added.

773
774
775
776
777
778
779
780
781
782
783
784
785
786
2013-08-13  Sam Weinig  <sam@webkit.org>

        [Re-land] Cleanup MediaQueryListListener
        https://bugs.webkit.org/show_bug.cgi?id=119664

        Reviewed by Andreas Kling.

        * fast/media/media-query-list-07-expected.txt:
        * fast/media/media-query-list-07.html:
        * platform/mac/TestExpectations:
        Update test to reflect that we are supposed to throw exceptions when when not passing a callback
        object to addListener/removeListener. Also update the test to use the internals interface that is
        supported by more ports.

787
788
789
790
791
792
2013-08-13  Alexey Proskuryakov  <ap@apple.com>

        Removed a bogus comment that didn't have any bugs after it.

        * platform/mac/TestExpectations:

793
794
795
796
797
798
799
800
801
2013-08-13  Alexey Proskuryakov  <ap@apple.com>

        REGRESSION(r139282): Old caret sometimes gets "stuck" (not repainted) in contenteditable elements.
        https://bugs.webkit.org/show_bug.cgi?id=119520

        * fast/repaint/caret-jump-between-nodes-expected.txt: Test was failing everywhere.
        Landing current Mac results to make bots greener, but Andreas should take a look at
        fixing the test.

802
803
804
805
806
807
808
809
810
811
2013-08-13  Robert Hogan  <robert@webkit.org>

        Section's collapsed borders painted in wrong place in rtl tables
        https://bugs.webkit.org/show_bug.cgi?id=119691

        Reviewed by Darin Adler.

        * fast/table/paint-collapsed-borders-rtl-section-expected.html: Added.
        * fast/table/paint-collapsed-borders-rtl-section.html: Added.

812
813
814
815
816
817
818
819
820
821
822
823
824
825
826
827
828
2013-08-13  Christophe Dumez  <ch.dumez@sisa.samsung.com>

        NodeList.item() does not behave according to specification
        https://bugs.webkit.org/show_bug.cgi?id=119722

        Reviewed by Darin Adler.

        Add a layout test to check that the NodeList.item() indexed getter's
        argument is properly validated. Also, update the following test case now
        that the argument is mandatory:
        fast/dom/non-numeric-values-numeric-parameters.html

        * fast/dom/nodelist-item-parameter-expected.txt: Added.
        * fast/dom/nodelist-item-parameter.html: Added.
        * fast/dom/non-numeric-values-numeric-parameters-expected.txt:
        * fast/dom/script-tests/non-numeric-values-numeric-parameters.js:

829
830
831
832
833
834
835
836
837
838
2013-08-13  Allan Sandfeld Jensen  <allan.jensen@digia.com>

        REGRESSION(SUBPIXEL_LAYOUT) Composited layers can cause one pixel shifts
        https://bugs.webkit.org/show_bug.cgi?id=115304

        Reviewed by David Hyatt.

        * fast/sub-pixel/sub-pixel-composited-layers-expected.html: Added.
        * fast/sub-pixel/sub-pixel-composited-layers.html: Added.

839
840
841
842
843
844
845
846
847
848
849
850
851
852
853
854
855
2013-08-13  Christophe Dumez  <ch.dumez@sisa.samsung.com>

        HTMLSelectElement.item() does not behave according to specification
        https://bugs.webkit.org/show_bug.cgi?id=119738

        Reviewed by Darin Adler.

        Add a new layout test to check that the HTMLSelectElement.item() indexed getter's
        parameter is correctly validated.
        Also update fast/dom/non-numeric-values-numeric-parameters.html now that the
        argument is mandatory.

        * fast/dom/HTMLSelectElement/select-element-item-argument-expected.txt: Added.
        * fast/dom/HTMLSelectElement/select-element-item-argument.html: Added.
        * fast/dom/non-numeric-values-numeric-parameters-expected.txt:
        * fast/dom/script-tests/non-numeric-values-numeric-parameters.js:

856
857
858
859
860
861
862
863
864
865
866
867
868
869
870
871
2013-08-13  Christophe Dumez  <ch.dumez@sisa.samsung.com>

        On request error, always fire events on the XMLHttpRequestUpload before the XMLHttpRequest
        https://bugs.webkit.org/show_bug.cgi?id=119714

        Reviewed by Alexey Proskuryakov.

        Add a layout test to validate the order in which the events are fired in case
        of a xhr request error. Also update an existing test which was relying on the
        outdated firing order.

        * http/tests/xmlhttprequest/simple-cross-origin-progress-events-expected.txt:
        * http/tests/xmlhttprequest/simple-cross-origin-progress-events.html:
        * http/tests/xmlhttprequest/upload-request-error-event-order-expected.txt: Added.
        * http/tests/xmlhttprequest/upload-request-error-event-order.html: Added.

872
873
874
875
876
877
878
879
880
881
882
883
2013-08-13  Gabor Abraham  <abrhm@inf.u-szeged.hu>

        [Qt] Unreviewed gardening. Rebase tests after r153901 and r153915. Skip failing tests.

        * platform/qt-5.0-wk2/TestExpectations:
        * platform/qt-5.0-wk2/svg/W3C-SVG-1.1/struct-dom-03-b-expected.png: Removed.
        * platform/qt-5.0/http/tests/security/xss-DENIED-xsl-document-redirect-expected.txt: Removed.
        * platform/qt/TestExpectations:
        * platform/qt/http/tests/security/xss-DENIED-xsl-document-redirect-expected.txt: Added.
        * platform/qt/svg/W3C-SVG-1.1/struct-dom-03-b-expected.png:
        * platform/qt/svg/W3C-SVG-1.1/struct-dom-03-b-expected.txt: Added.

884
885
886
887
888
889
890
2013-08-13  Zan Dobersek  <zdobersek@igalia.com>

        Unreviewed GTK gardening.

        * platform/gtk/TestExpectations: Simplify test failure expectations to remove various lint failures,
        also removing a couple of expectations for tests that are passing in the process.

891
892
893
894
895
896
897
898
2013-08-13  Zan Dobersek  <zdobersek@igalia.com>

        Unreviewed GTK gardening.

        * platform/gtk/fast/repaint/caret-jump-between-nodes-expected.txt: Added. Rebaselining after r153815.
        * platform/gtk/svg/W3C-SVG-1.1/struct-dom-03-b-expected.png: Rebaselining after r153901.
        * platform/gtk/svg/W3C-SVG-1.1/struct-dom-03-b-expected.txt: Ditto.

899
900
901
902
903
904
2013-08-13  Zan Dobersek  <zdobersek@igalia.com>

        Unreviewed GTK gardening.

        * platform/gtk/TestExpectations: Add failure expectations for various failing tests.

905
906
907
908
909
910
911
2013-08-13  Gabor Abraham  <abrhm@inf.u-szeged.hu>

        [Qt] Unreviewed gardening. Skipping new fails.

        * platform/qt-5.0-wk1/TestExpectations:
        * platform/qt/TestExpectations:

912
913
914
915
916
917
918
919
920
921
922
923
2013-08-13  Arpita Bahuguna  <a.bah@samsung.com>

        Adding testcase for verifying editing behavior for up/down caret movement between lines.
        https://bugs.webkit.org/show_bug.cgi?id=119511

        Reviewed by Ryosuke Niwa.

        * editing/selection/verify-editing-behavior-for-line-granularity-expected.txt: Added.
        * editing/selection/verify-editing-behavior-for-line-granularity.html: Added.
        Layout testcase added for verifying that the up/down caret movement between
        lines is similar to the default text editor behavior on various platforms.

924
925
926
927
928
929
930
931
932
933
934
935
936
937
938
939
940
941
2013-08-13  Andrei Bucur  <abucur@adobe.com>

        [CSS Regions] Compute correct region ranges for boxes
        https://bugs.webkit.org/show_bug.cgi?id=116296

        Reviewed by David Hyatt.

        Tests for the changes in how region ranges are computed and applied.

        * fast/regions/bottom-overflow-out-of-first-region-absolute-expected.html: Added.
        * fast/regions/bottom-overflow-out-of-first-region-absolute.html: Added.
        * fast/regions/float-pushed-width-change-2-expected.html: Copied from LayoutTests/fast/regions/float-pushed-width-change-expected.html.
        * fast/regions/float-pushed-width-change-2.html: Copied from LayoutTests/fast/regions/float-pushed-width-change.html.
        * fast/regions/float-pushed-width-change-expected.html:
        * fast/regions/float-pushed-width-change.html:
        * fast/regions/scrollable-paragraph-unsplittable-expected.html: Added.
        * fast/regions/scrollable-paragraph-unsplittable.html: Added.

942
943
944
945
946
947
948
949
2013-08-13  Zan Dobersek  <zdobersek@igalia.com>

        Unreviewed GTK gardening.

        * platform/gtk/editing/caret/caret-color-expected.txt: Rebaselining after r152612.
        * platform/gtk/fast/js/dom-static-property-for-in-iteration-expected.txt: Rebaselining after r153772.
        * platform/gtk/fast/js/global-constructors-attributes-expected.txt: Ditto.

950
951
952
953
954
955
956
957
958
959
960
961
962
963
964
965
966
967
968
969
970
2013-08-13  Zan Dobersek  <zdobersek@igalia.com>

        Unreviewed GTK gardening.
        Rebaselining after r153647.

        * platform/gtk/fast/css/input-search-padding-expected.txt:
        * platform/gtk/fast/css/text-overflow-input-expected.txt:
        * platform/gtk/fast/forms/box-shadow-override-expected.txt:
        * platform/gtk/fast/forms/control-restrict-line-height-expected.txt:
        * platform/gtk/fast/forms/input-appearance-height-expected.txt:
        * platform/gtk/fast/forms/placeholder-position-expected.txt:
        * platform/gtk/fast/forms/placeholder-pseudo-style-expected.txt:
        * platform/gtk/fast/forms/search-cancel-button-style-sharing-expected.txt:
        * platform/gtk/fast/forms/search-display-none-cancel-button-expected.txt:
        * platform/gtk/fast/forms/search-rtl-expected.txt:
        * platform/gtk/fast/forms/search-size-with-decorations-expected.txt: Added.
        * platform/gtk/fast/forms/search-styled-expected.txt:
        * platform/gtk/fast/forms/search-vertical-alignment-expected.txt:
        * platform/gtk/fast/forms/searchfield-heights-expected.txt:
        * platform/gtk/fast/repaint/search-field-cancel-expected.txt:

971
972
973
974
975
976
977
978
979
980
981
982
983
984
985
986
987
988
989
2013-08-13  Gyuyoung Kim  <gyuyoung.kim@samsung.com>

        Update scheme list according to latest specification
        https://bugs.webkit.org/show_bug.cgi?id=119510

        Reviewed by Christophe Dumez.

        New schemes are added to it additionally. Those are bitcoin, im, ircs and wtai.
        As additional work, scheme order is listed to be sync with spec.

        Spec: http://www.w3.org/html/wg/drafts/html/master/webappapis.html#custom-handlers

        * fast/dom/register-protocol-handler-expected.txt:
        * fast/dom/register-protocol-handler.html:
        * fast/dom/unregister-protocol-handler-expected.txt:
        * fast/dom/unregister-protocol-handler.html:
        * platform/efl/fast/dom/register-protocol-handler-expected.txt:
        * platform/efl/fast/dom/unregister-protocol-handler-expected.txt:

990
991
992
993
994
995
996
997
998
999
1000
1001
2013-08-12  Ryosuke Niwa  <rniwa@webkit.org>

        Fix null dereference in HTMLAnchorElement::sendPings when frame is not attached to a page
        https://bugs.webkit.org/show_bug.cgi?id=119716

        Reviewed by Darin Adler.

        Add a regression test for r153975.

        * fast/html/detach-frame-while-clicking-on-anchor-with-ping-expected.txt: Added.
        * fast/html/detach-frame-while-clicking-on-anchor-with-ping.html: Added.

1002
1003
1004
1005
1006
1007
1008
1009
1010
1011
1012
1013
1014
1015
1016
2013-08-12  Zan Dobersek  <zdobersek@igalia.com>

        ASSERTION FAILED: type() == Percent in WebCore::Length::percent
        https://bugs.webkit.org/show_bug.cgi?id=116715

        Reviewed by Darin Adler.

        Add the test case, as produced by the Fuzzinator, that was causing assertions
        in Length::percent due to Length objects of the Calculated type not being treated
        as holding a proper percent value in that method, despite Length::isPercent
        returning true for Length objects of either Percent or the Calculated type.

        * fast/css/calculated-length-as-percent-crash-expected.txt: Added.
        * fast/css/calculated-length-as-percent-crash.html: Added.

1017
1018
1019
1020
1021
1022
1023
1024
1025
1026
1027
1028
1029
1030
2013-08-12  Alexey Proskuryakov  <ap@apple.com>

        http/tests/security/sandboxed-iframe-invalid.html is flaky on Mac
        https://bugs.webkit.org/show_bug.cgi?id=85522

        Reviewed by Andy Estes.

        * http/tests/security/sandboxed-iframe-form-top-expected.txt: Console logging got
        improved while this test was marked as skipped or flaky, updating the results.

        * platform/mac/TestExpectations: Removed sandboxed-iframe-form-top.html, this test
        no longer leaks output into later ones. The test was erroneously marked as flaky
        instead of skipped, but now it's good.

1031
1032
1033
1034
1035
1036
1037
1038
1039
1040
1041
1042
1043
1044
1045
1046
1047
1048
1049
1050
1051
1052
1053
1054
1055
1056
1057
1058
1059
1060
1061
1062
1063
1064
1065
1066
1067
1068
1069
2013-08-12  Ryuan Choi  <ryuan.choi@samsung.com>

        [EFL] Unreviewed gardening.

        Add a missing result after r152911.

        * platform/efl/fast/multicol/pagination/BottomToTop-bt-expected.png: Added.
        * platform/efl/fast/multicol/pagination/BottomToTop-bt-expected.txt: Added.
        * platform/efl/fast/multicol/pagination/BottomToTop-lr-expected.png: Added.
        * platform/efl/fast/multicol/pagination/BottomToTop-lr-expected.txt: Added.
        * platform/efl/fast/multicol/pagination/BottomToTop-rl-expected.png: Added.
        * platform/efl/fast/multicol/pagination/BottomToTop-rl-expected.txt: Added.
        * platform/efl/fast/multicol/pagination/BottomToTop-tb-expected.png: Added.
        * platform/efl/fast/multicol/pagination/BottomToTop-tb-expected.txt: Added.
        * platform/efl/fast/multicol/pagination/LeftToRight-bt-expected.png: Added.
        * platform/efl/fast/multicol/pagination/LeftToRight-bt-expected.txt: Added.
        * platform/efl/fast/multicol/pagination/LeftToRight-lr-expected.png: Added.
        * platform/efl/fast/multicol/pagination/LeftToRight-lr-expected.txt: Added.
        * platform/efl/fast/multicol/pagination/LeftToRight-rl-expected.png: Added.
        * platform/efl/fast/multicol/pagination/LeftToRight-rl-expected.txt: Added.
        * platform/efl/fast/multicol/pagination/LeftToRight-tb-expected.png: Added.
        * platform/efl/fast/multicol/pagination/LeftToRight-tb-expected.txt: Added.
        * platform/efl/fast/multicol/pagination/RightToLeft-bt-expected.png: Added.
        * platform/efl/fast/multicol/pagination/RightToLeft-bt-expected.txt: Added.
        * platform/efl/fast/multicol/pagination/RightToLeft-lr-expected.png: Added.
        * platform/efl/fast/multicol/pagination/RightToLeft-lr-expected.txt: Added.
        * platform/efl/fast/multicol/pagination/RightToLeft-rl-expected.png: Added.
        * platform/efl/fast/multicol/pagination/RightToLeft-rl-expected.txt: Added.
        * platform/efl/fast/multicol/pagination/RightToLeft-tb-expected.png: Added.
        * platform/efl/fast/multicol/pagination/RightToLeft-tb-expected.txt: Added.
        * platform/efl/fast/multicol/pagination/TopToBottom-bt-expected.png: Added.
        * platform/efl/fast/multicol/pagination/TopToBottom-bt-expected.txt: Added.
        * platform/efl/fast/multicol/pagination/TopToBottom-lr-expected.png: Added.
        * platform/efl/fast/multicol/pagination/TopToBottom-lr-expected.txt: Added.
        * platform/efl/fast/multicol/pagination/TopToBottom-rl-expected.png: Added.
        * platform/efl/fast/multicol/pagination/TopToBottom-rl-expected.txt: Added.
        * platform/efl/fast/multicol/pagination/TopToBottom-tb-expected.png: Added.
        * platform/efl/fast/multicol/pagination/TopToBottom-tb-expected.txt: Added.

1070
1071
1072
1073
1074
1075
1076
1077
1078
1079
1080
1081
2013-08-12  Ryuan Choi  <ryuan.choi@samsung.com>

        [EFL] Unreviewed gardening.

        * platform/efl/TestExpectations: Added pasteboard after r152185.
        * platform/efl/editing/deleting/delete-br-002-expected.txt: Updated after r152478.
        * platform/efl/editing/execCommand/outdent-blockquote-test1-expected.txt:
        Removed platform specific expectations after r152494.
        * platform/efl/editing/execCommand/outdent-blockquote-test2-expected.txt: Ditto.
        * platform/efl/editing/execCommand/outdent-blockquote-test3-expected.txt: Ditto.
        * platform/efl/editing/execCommand/outdent-blockquote-test4-expected.txt: Ditto.

1082
1083
1084
1085
1086
1087
1088
1089
1090
1091
2013-08-12  Ryosuke Niwa  <rniwa@webkit.org>

        Layout Test fast/overflow/scrollbar-click-retains-focus.html is failing on Apple Mac WK1 and GTK.
        https://bugs.webkit.org/show_bug.cgi?id=104104

        Add back test expectation for Mac since it's still failing on ML WK1 bots.

        * platform/mac/TestExpectations:
        * platform/mac-wk2/TestExpectations:

1092
1093
1094
1095
1096
1097
1098
1099
1100
1101
1102
1103
1104
1105
1106
1107
1108
1109
1110
1111
1112
1113
1114
1115
2013-08-12  Christophe Dumez  <ch.dumez@sisa.samsung.com>

        Define DOM_KEY_LOCATION_* constants on KeyboardEvent
        https://bugs.webkit.org/show_bug.cgi?id=119341

        Reviewed by Ryosuke Niwa.

        Make use of the new DOM_KEY_LOCATION_* constants in the KeyboardEvent
        test cases instead of hardcoding their values.

        * fast/events/constructors/keyboard-event-constructor-expected.txt:
        * fast/events/constructors/keyboard-event-constructor.html:
        * fast/events/js-keyboard-event-creation-expected.txt:
        * fast/events/js-keyboard-event-creation.html:
        * fast/events/keyboardevent-location-constants-expected.txt: Added.
        * fast/events/keyboardevent-location-constants.html: Added.
        * fast/events/keydown-leftright-keys-expected.txt:
        * fast/events/keydown-leftright-keys.html:
        * fast/events/keydown-numpad-keys-expected.txt:
        * fast/events/script-tests/keydown-numpad-keys.js:
        (testKeyEventWithLocation):
        * platform/efl/fast/events/js-keyboard-event-creation-expected.txt:
        * platform/gtk/fast/events/js-keyboard-event-creation-expected.txt:

1116
1117
1118
1119
1120
1121
1122
1123
1124
1125
1126
2013-08-12  Alexey Proskuryakov  <ap@apple.com>

        Multiple CSP tests complain about undefined strings in echo-object-data.pl and echo-script-src.pl
        https://bugs.webkit.org/show_bug.cgi?id=119692

        Reviewed by Darin Adler.

        * http/tests/security/contentSecurityPolicy/resources/echo-object-data.pl:
        * http/tests/security/contentSecurityPolicy/resources/echo-script-src.pl:
        Check whether optional CGI parameters are provided.

1127
1128
1129
1130
1131
1132
1133
1134
1135
1136
1137
1138
2013-08-12  Dean Jackson  <dino@apple.com>

        Shadows don't support viewport units
        https://bugs.webkit.org/show_bug.cgi?id=119649

        Reviewed by Darin Adler.

        Test that exercises a viewport unit in text-shadow to make sure we don't parse it.

        * fast/css/shadow-viewport-units-expected.txt: Added.
        * fast/css/shadow-viewport-units.html: Added.

1139
1140
1141
1142
1143
1144
1145
1146
1147
1148
1149
2013-08-12  Allan Sandfeld Jensen  <allan.jensen@digia.com>

        [Qt] Add Support for canvas blend modes
        https://bugs.webkit.org/show_bug.cgi?id=100072

        Reviewed by Jocelyn Turcotte.

        Unskip tests that now passes.

        * platform/qt/TestExpectations:

1150
1151
1152
1153
1154
1155
1156
1157
1158
1159
1160
1161
1162
1163
1164
1165
1166
1167
1168
1169
1170
1171
1172
1173
1174
1175
2013-08-12  Zoltan Arvai  <zarvai@inf.u-szeged.hu>

        [Qt] Unreviewed gardening. Rebaselining after r153903.

        * platform/qt-5.0-wk1/fast/loader/main-document-url-for-non-http-loads-expected.txt: Added.
        * platform/qt-5.0-wk1/http/tests/cache/iframe-304-crash-expected.txt: Added.
        * platform/qt-5.0-wk1/http/tests/loading/307-after-303-after-post-expected.txt: Added.
        * platform/qt-5.0-wk1/http/tests/loading/redirect-methods-expected.txt: Added.
        * platform/qt-5.0-wk1/http/tests/misc/favicon-loads-with-images-disabled-expected.txt: Added.
        * platform/qt-5.0-wk1/http/tests/security/XFrameOptions/x-frame-options-allowall-expected.txt: Added.
        * platform/qt-5.0-wk1/http/tests/security/XFrameOptions/x-frame-options-deny-meta-tag-parent-same-origin-allow-expected.txt: Added.
        * platform/qt-5.0-wk1/http/tests/security/XFrameOptions/x-frame-options-invalid-expected.txt: Added.
        * platform/qt-5.0-wk1/http/tests/security/XFrameOptions/x-frame-options-multiple-headers-sameorigin-allow-expected.txt: Added.
        * platform/qt-5.0-wk1/http/tests/security/XFrameOptions/x-frame-options-parent-same-origin-allow-expected.txt: Added.
        * platform/qt-5.0-wk2/compositing/geometry/preserve-3d-switching-expected.txt:
        * platform/qt-5.0-wk2/http/tests/misc/will-send-request-returns-null-on-redirect-expected.txt:
        * platform/qt-5.0-wk2/http/tests/misc/window-dot-stop-expected.txt:
        * platform/qt-5.0-wk2/http/tests/security/XFrameOptions/x-frame-options-deny-expected.txt:
        * platform/qt-5.0-wk2/http/tests/security/XFrameOptions/x-frame-options-deny-meta-tag-expected.txt:
        * platform/qt-5.0-wk2/http/tests/security/XFrameOptions/x-frame-options-deny-meta-tag-in-body-expected.txt:
        * platform/qt-5.0-wk2/http/tests/security/XFrameOptions/x-frame-options-deny-meta-tag-parent-same-origin-deny-expected.txt:
        * platform/qt-5.0-wk2/http/tests/security/XFrameOptions/x-frame-options-multiple-headers-conflict-expected.txt:
        * platform/qt-5.0-wk2/http/tests/security/XFrameOptions/x-frame-options-multiple-headers-sameorigin-deny-expected.txt:
        * platform/qt-5.0-wk2/http/tests/security/XFrameOptions/x-frame-options-parent-same-origin-deny-expected.txt:
        * platform/qt-5.0-wk2/loader/go-back-cached-main-resource-expected.txt:

1176
1177
1178
1179
1180
1181
1182
1183
1184
1185
1186
1187
1188
1189
1190
2013-08-12  Grzegorz Czajkowski  <g.czajkowski@samsung.com>

        Update spellcheck-attribute.html description.
        https://bugs.webkit.org/show_bug.cgi?id=119486

        Reviewed by Ryosuke Niwa.

        r70512 r72782 added new fields to spellcheck-attribute.html to verify
        spellcheck attribute.
        Update the test to be more descriptive by dumping additional information
        whether the misspelled word should be marked or not.

        * editing/spelling/spellcheck-attribute-expected.txt:
        * editing/spelling/spellcheck-attribute.html:

1191
1192
1193
1194
1195
1196
1197
1198
1199
1200
1201
2013-08-09  Alexey Proskuryakov  <ap@apple.com>

        Merge an encoding test from Blink
        https://bugs.webkit.org/show_bug.cgi?id=116943

        Original patch by Adam Barth.

        * fast/encoding/meta-overrules-auto-expected.txt: Added.
        * fast/encoding/meta-overrules-auto.html: Added.
        * fast/encoding/resources/meta-input-encoding.html: Added.

1202
1203
1204
1205
1206
1207
1208
1209
1210
1211
1212
1213
1214
1215
1216
1217
1218
1219
1220
1221
1222
1223
1224
1225
1226
1227
1228
1229
1230
1231
1232
1233
1234
1235
1236
1237
1238
1239
1240
1241
1242
1243
1244
1245
1246
1247
1248
1249
1250
1251
1252
1253
2013-08-09  Alexey Proskuryakov  <ap@apple.com>

        Tests that dump delegate calls are flaky because of cached redirects
        https://bugs.webkit.org/show_bug.cgi?id=119641

        Reviewed by Brady Eidson.

        Made redirect.php emit Cache-Control: no store as a workaround for bug 77538.
        Removed several reimplementations of it, and changed the test to use the
        central copy.

        * http/tests/permissionclient/resources/redir.php: Removed.
        * http/tests/resources/redirect.php:
        * http/tests/security/beforeload-iframe-server-redirect-expected.txt:
        * http/tests/security/beforeload-iframe-server-redirect.html:
        * http/tests/security/cannot-read-cssrules-redirect.html:
        * http/tests/security/canvas-remote-read-redirect-to-remote-image.html:
        * http/tests/security/canvas-remote-read-remote-image-redirect.html:
        * http/tests/security/contentSecurityPolicy/frame-src-redirect-blocked.html:
        * http/tests/security/contentSecurityPolicy/resources/multiple-iframe-test.js:
        * http/tests/security/contentSecurityPolicy/resources/redir.php: Removed.
        * http/tests/security/contentSecurityPolicy/script-src-redirect-expected.txt:
        * http/tests/security/contentSecurityPolicy/script-src-redirect.html:
        * http/tests/security/cross-origin-css.html:
        * http/tests/security/cross-origin-script-window-onerror-redirected.html:
        * http/tests/security/mixedContent/redirect-http-to-https-iframe-in-main-frame-expected.txt:
        * http/tests/security/mixedContent/redirect-http-to-https-script-in-iframe-expected.txt:
        * http/tests/security/mixedContent/redirect-https-to-http-iframe-in-main-frame-expected.txt:
        * http/tests/security/mixedContent/resources/frame-with-redirect-http-to-https-frame.html:
        * http/tests/security/mixedContent/resources/frame-with-redirect-http-to-https-script.html:
        * http/tests/security/mixedContent/resources/frame-with-redirect-https-to-http-frame.html:
        * http/tests/security/mixedContent/resources/frame-with-redirect-https-to-http-script.html:
        * http/tests/security/redirect-BLOCKED-to-localURL.html:
        * http/tests/security/resources/cross-origin-xsl-redirect.xml:
        * http/tests/security/resources/redir.php: Removed.
        * http/tests/security/resources/xsl-using-document-redirect.xsl:
        * http/tests/security/resources/xsl-using-external-entity-redirect.xsl:
        * http/tests/security/stylesheet-href-redirect-expected.txt:
        * http/tests/security/stylesheet-href-redirect.html:
        * http/tests/security/xssAuditor/block-does-not-leak-referrer.html:
        * http/tests/security/xssAuditor/resources/redir.php: Removed.
        * http/tests/security/xssAuditor/script-tag-open-redirect.html:
        * http/tests/security/xssAuditor/script-tag-redirect.html:
        * http/tests/xmlhttprequest/redirect-cross-origin-2.html:
        * http/tests/xmlhttprequest/redirect-cross-origin-post-sync.html:
        * http/tests/xmlhttprequest/redirect-cross-origin-post.html:
        * http/tests/xmlhttprequest/redirect-cross-origin-sync-double.html:
        * http/tests/xmlhttprequest/redirect-cross-origin-sync.html:
        * http/tests/xmlhttprequest/redirect-cross-origin.html:
        * http/tests/xmlhttprequest/resources/redirect.php: Removed.
        * http/tests/xmlhttprequest/xmlhttprequest-unsafe-redirect.html:

1254
1255
1256
1257
1258
1259
1260
1261
1262
1263
1264
1265
2013-08-09  Rob Buis  <rwlbuis@webkit.org>

        ASSERTION FAILED: stroke->opacity != other->stroke->opacity in WebCore::SVGRenderStyle::diff
        https://bugs.webkit.org/show_bug.cgi?id=119623

        Reviewed by Dirk Schulze.

        Add testcase from bug with small adjustments.

        * svg/animations/animate-stroke-crasher-expected.txt: Added.
        * svg/animations/animate-stroke-crasher.html: Added.

1266
1267
1268
1269
1270
1271
1272
1273
1274
1275
2013-08-09  Alexey Proskuryakov  <ap@apple.com>

        REGRESSION (r142755): window.open creates an invisible window when width and height are 0
        https://bugs.webkit.org/show_bug.cgi?id=119633

        Reviewed by Darin Adler.

        * fast/dom/Window/open-zero-size-as-default-expected.txt: Added.
        * fast/dom/Window/open-zero-size-as-default.html: Added.

1276
1277
1278
1279
1280
1281
1282
2013-08-09  Alexey Proskuryakov  <ap@apple.com>

        http/tests/navigation/back-twice-without-commit.html times out
        https://bugs.webkit.org/show_bug.cgi?id=82980

        * platform/mac/TestExpectations: Marked as such again, reverting r153842.

1283
1284
1285
1286
1287
1288
1289
1290
1291
1292
1293
1294
1295
1296
1297
1298
1299
1300
1301
1302
1303
1304
1305
1306
1307
1308
1309
2013-08-09  Christophe Dumez  <ch.dumez@sisa.samsung.com>

        Add support for KeyboardEvent.location attribute
        https://bugs.webkit.org/show_bug.cgi?id=119326

        Reviewed by Benjamin Poulain.

        Rename KeyboardEvent.keyLocation to KeyboardEvent.location in the
        tests and add test cases to make sure that the deprecated
        KeyboardEvent.keyLocation still works.

        * fast/events/arrow-keys-on-body-expected.txt:
        * fast/events/arrow-keys-on-body.html:
        * fast/events/constructors/keyboard-event-constructor-expected.txt:
        * fast/events/constructors/keyboard-event-constructor.html:
        * fast/events/init-events-expected.txt:
        * fast/events/js-keyboard-event-creation.html:
        * fast/events/keydown-leftright-keys-expected.txt:
        * fast/events/keydown-leftright-keys.html:
        * fast/events/keydown-numpad-keys-expected.txt:
        * fast/events/script-tests/init-events.js:
        * fast/events/script-tests/keydown-numpad-keys.js:
        (recordKeyEvent):
        (testKeyEventWithLocation):
        * platform/mac/fast/events/objc-keyboard-event-creation.html:
        * platform/win/fast/events/keyLocation-numpad.html:

1310
1311
1312
1313
1314
1315
1316
1317
1318
1319
1320
1321
1322
1323
2013-08-09  Christophe Dumez  <ch.dumez@sisa.samsung.com>

        Make atob() throw an InvalidCharacterError on excess padding characters
        https://bugs.webkit.org/show_bug.cgi?id=118898

        Reviewed by Darin Adler.

        Update and rebaseline fast/dom/Window/atob-btoa.html now that window.atob()'s
        behavior has changed and now that we throw an InvalidCharacterError on excess
        pad characters.

        * fast/dom/Window/atob-btoa-expected.txt:
        * fast/dom/Window/atob-btoa.html:

1324
1325
1326
1327
1328
1329
1330
1331
1332
1333
1334
1335
1336
1337
1338
1339
1340
1341
1342
1343
1344
1345
1346
1347
1348
1349
1350
1351
1352
1353
1354
1355
1356
1357
1358
1359
1360
1361
1362
1363
1364
1365
1366
1367
1368
1369
1370
1371
1372
1373
2013-08-09  Alexey Proskuryakov  <ap@apple.com>

        <unknown> is often dumped instead of path in test output
        https://bugs.webkit.org/show_bug.cgi?id=119590

        Reviewed by Anders Carlsson.

        Updating test results.

        * fast/loader/file-protocol-fragment-expected.txt:
        * fast/loader/main-document-url-for-non-http-loads-expected.txt:
        * http/tests/cache/iframe-304-crash-expected.txt:
        * http/tests/cache/willsendrequest-returns-null-for-memory-cache-load-expected.txt:
        * http/tests/loading/307-after-303-after-post-expected.txt:
        * http/tests/loading/authentication-after-redirect-stores-wrong-credentials/authentication-after-redirect-stores-wrong-credentials-expected.txt:
        * http/tests/loading/basic-auth-resend-wrong-credentials-expected.txt:
        * http/tests/loading/basic-credentials-sent-automatically-expected.txt:
        * http/tests/loading/redirect-methods-expected.txt:
        * http/tests/misc/401-alternative-content-expected.txt:
        * http/tests/misc/authentication-redirect-1/authentication-sent-to-redirect-cross-origin-expected.txt:
        * http/tests/misc/authentication-redirect-2/authentication-sent-to-redirect-same-origin-expected.txt:
        * http/tests/misc/authentication-redirect-4/authentication-sent-to-redirect-same-origin-url-expected.txt:
        * http/tests/misc/favicon-loads-with-images-disabled-expected.txt:
        * http/tests/misc/link-rel-icon-beforeload-expected.txt:
        * http/tests/misc/will-send-request-returns-null-on-redirect-expected.txt:
        * http/tests/misc/window-dot-stop-expected.txt:
        * http/tests/security/401-logout/401-logout-expected.txt:
        * http/tests/security/XFrameOptions/x-frame-options-allowall-expected.txt:
        * http/tests/security/XFrameOptions/x-frame-options-deny-expected.txt:
        * http/tests/security/XFrameOptions/x-frame-options-deny-meta-tag-expected.txt:
        * http/tests/security/XFrameOptions/x-frame-options-deny-meta-tag-in-body-expected.txt:
        * http/tests/security/XFrameOptions/x-frame-options-deny-meta-tag-parent-same-origin-allow-expected.txt:
        * http/tests/security/XFrameOptions/x-frame-options-deny-meta-tag-parent-same-origin-deny-expected.txt:
        * http/tests/security/XFrameOptions/x-frame-options-invalid-expected.txt:
        * http/tests/security/XFrameOptions/x-frame-options-multiple-headers-conflict-expected.txt:
        * http/tests/security/XFrameOptions/x-frame-options-multiple-headers-sameorigin-allow-expected.txt:
        * http/tests/security/XFrameOptions/x-frame-options-multiple-headers-sameorigin-deny-expected.txt:
        * http/tests/security/XFrameOptions/x-frame-options-parent-same-origin-allow-expected.txt:
        * http/tests/security/XFrameOptions/x-frame-options-parent-same-origin-deny-expected.txt:
        * http/tests/xmlhttprequest/failed-auth-expected.txt:
        * http/tests/xmlhttprequest/remember-bad-password-expected.txt:
        * loader/go-back-cached-main-resource-expected.txt:
        * platform/efl-wk2/loader/go-back-cached-main-resource-expected.txt:
        * platform/mac/fast/images/support-broken-image-delegate-expected.txt:
        * platform/mac/security/block-test-expected.txt:
        * platform/mac/security/block-test-no-port-expected.txt:
        * platform/mac/webarchive/loading/cache-expired-subresource-expected.txt:
        * webarchive/loading/test-loading-archive-expected.txt:
        * webarchive/loading/test-loading-archive-subresource-null-mimetype-expected.txt:

1374
1375
1376
1377
1378
1379
1380
1381
1382
1383
1384
1385
1386
1387
1388
1389
1390
1391
1392
1393
1394
1395
1396
1397
1398
1399
1400
1401
1402
1403
1404
1405
1406
1407
1408
1409
1410
1411
1412
1413
1414
1415
1416
1417
1418
1419
1420
1421
1422
1423
1424
1425
1426
2013-08-09  Mihai Tica  <mitica@adobe.com>

        Modify the existing canvas blending test suite to test both
        accelerated and non accelerated modes.
        https://bugs.webkit.org/show_bug.cgi?id=119628

        Reviewed by Dirk Schulze.

        * fast/canvas/canvas-blending-clipping-expected.txt:
        * fast/canvas/canvas-blending-clipping.html:
        * fast/canvas/canvas-blending-color-over-color-expected.txt:
        * fast/canvas/canvas-blending-color-over-color.html:
        * fast/canvas/canvas-blending-color-over-gradient-expected.txt:
        * fast/canvas/canvas-blending-color-over-gradient.html:
        * fast/canvas/canvas-blending-color-over-image-expected.txt:
        * fast/canvas/canvas-blending-color-over-image.html:
        * fast/canvas/canvas-blending-color-over-pattern-expected.txt:
        * fast/canvas/canvas-blending-color-over-pattern.html:
        * fast/canvas/canvas-blending-fill-style-expected.txt:
        * fast/canvas/canvas-blending-fill-style.html:
        * fast/canvas/canvas-blending-global-alpha-expected.txt:
        * fast/canvas/canvas-blending-global-alpha.html:
        * fast/canvas/canvas-blending-gradient-over-color-expected.txt:
        * fast/canvas/canvas-blending-gradient-over-color.html:
        * fast/canvas/canvas-blending-gradient-over-gradient-expected.txt:
        * fast/canvas/canvas-blending-gradient-over-gradient.html:
        * fast/canvas/canvas-blending-gradient-over-image-expected.txt:
        * fast/canvas/canvas-blending-gradient-over-image.html:
        * fast/canvas/canvas-blending-gradient-over-pattern-expected.txt:
        * fast/canvas/canvas-blending-gradient-over-pattern.html:
        * fast/canvas/canvas-blending-image-over-color-expected.txt:
        * fast/canvas/canvas-blending-image-over-color.html:
        * fast/canvas/canvas-blending-image-over-gradient-expected.txt:
        * fast/canvas/canvas-blending-image-over-gradient.html:
        * fast/canvas/canvas-blending-image-over-image-expected.txt:
        * fast/canvas/canvas-blending-image-over-image.html:
        * fast/canvas/canvas-blending-image-over-pattern-expected.txt:
        * fast/canvas/canvas-blending-image-over-pattern.html:
        * fast/canvas/canvas-blending-pattern-over-color-expected.txt:
        * fast/canvas/canvas-blending-pattern-over-color.html:
        * fast/canvas/canvas-blending-pattern-over-gradient-expected.txt:
        * fast/canvas/canvas-blending-pattern-over-gradient.html:
        * fast/canvas/canvas-blending-pattern-over-image-expected.txt:
        * fast/canvas/canvas-blending-pattern-over-image.html:
        * fast/canvas/canvas-blending-pattern-over-pattern-expected.txt:
        * fast/canvas/canvas-blending-pattern-over-pattern.html:
        * fast/canvas/canvas-blending-shadow-expected.txt:
        * fast/canvas/canvas-blending-shadow.html:
        * fast/canvas/canvas-blending-text-expected.txt:
        * fast/canvas/canvas-blending-text.html:
        * fast/canvas/canvas-blending-transforms-expected.txt:
        * fast/canvas/canvas-blending-transforms.html:

1427
1428
1429
1430
1431
1432
1433
1434
1435
1436
1437
1438
1439
1440
1441
1442
1443
1444
1445
1446
1447
1448
1449
1450
1451
1452
1453
1454
1455
1456
1457
1458
1459
1460
1461
1462
1463
1464
1465
1466
1467
1468
1469
1470
1471
1472
1473
1474
1475
1476
1477
1478
1479
1480
1481
1482
1483
1484
1485
1486
1487
1488
1489
1490
1491
1492
1493
1494
1495
1496
1497
1498
1499
1500
1501
1502
1503
1504
1505
1506
1507
1508
2013-08-09  Christophe Dumez  <ch.dumez@sisa.samsung.com>

        Make DOMImplementation::hasFeature() behave according to specification
        https://bugs.webkit.org/show_bug.cgi?id=119329

        Reviewed by Ryosuke Niwa.

        Rebaseline several test cases now that DOMImplementation::hasFeature() returns
        true unconditionally for non-SVG features.

        Also use a valid svg prefix for unknown features in SVG tests so that they are
        properly recognized as SVG features and so that hasFeature() returns false as
        expected.

        * dom/xhtml/level3/core/hasFeature01-expected.txt:
        * dom/xhtml/level3/core/hasFeature02-expected.txt:
        * dom/xhtml/level3/core/hasFeature03-expected.txt:
        * dom/xhtml/level3/core/hasFeature04-expected.txt:
        * fast/dom/features-expected.txt:
        * platform/efl/svg/W3C-SVG-1.1-SE/types-dom-06-f-expected.txt:
        * platform/efl/svg/W3C-SVG-1.1/struct-dom-03-b-expected.txt:
        * platform/gtk/svg/W3C-SVG-1.1-SE/types-dom-06-f-expected.txt:
        * platform/gtk/svg/W3C-SVG-1.1/struct-dom-03-b-expected.txt:
        * platform/mac/svg/W3C-SVG-1.1-SE/types-dom-06-f-expected.txt:
        * platform/mac/svg/W3C-SVG-1.1/struct-dom-03-b-expected.txt:
        * platform/qt-mac/svg/W3C-SVG-1.1-SE/types-dom-06-f-expected.txt:
        * platform/qt/svg/W3C-SVG-1.1-SE/types-dom-06-f-expected.txt:
        * svg/W3C-SVG-1.1/struct-dom-03-b-expected.txt:
        * svg/custom/outer-svg-unknown-feature.svg:
        * svg/dynamic-updates/script-tests/SVGCircleElement-dom-requiredFeatures.js:
        (repaintTest):
        * svg/dynamic-updates/script-tests/SVGCircleElement-svgdom-requiredFeatures.js:
        (repaintTest):
        * svg/dynamic-updates/script-tests/SVGEllipseElement-dom-requiredFeatures.js:
        (repaintTest):
        * svg/dynamic-updates/script-tests/SVGEllipseElement-svgdom-requiredFeatures.js:
        (repaintTest):
        * svg/dynamic-updates/script-tests/SVGForeignObjectElement-dom-requiredFeatures.js:
        (repaintTest):
        * svg/dynamic-updates/script-tests/SVGForeignObjectElement-svgdom-requiredFeatures.js:
        (repaintTest):
        * svg/dynamic-updates/script-tests/SVGGElement-dom-requiredFeatures.js:
        (repaintTest):
        * svg/dynamic-updates/script-tests/SVGGElement-svgdom-requiredFeatures.js:
        (repaintTest):
        * svg/dynamic-updates/script-tests/SVGImageElement-dom-requiredFeatures.js:
        (repaintTest):
        * svg/dynamic-updates/script-tests/SVGImageElement-svgdom-requiredFeatures.js:
        (repaintTest):
        * svg/dynamic-updates/script-tests/SVGLineElement-dom-requiredFeatures.js:
        (repaintTest):
        * svg/dynamic-updates/script-tests/SVGLineElement-svgdom-requiredFeatures.js:
        (repaintTest):
        * svg/dynamic-updates/script-tests/SVGPathElement-dom-requiredFeatures.js:
        (repaintTest):
        * svg/dynamic-updates/script-tests/SVGPathElement-svgdom-requiredFeatures.js:
        (repaintTest):
        * svg/dynamic-updates/script-tests/SVGPolygonElement-dom-requiredFeatures.js:
        (repaintTest):
        * svg/dynamic-updates/script-tests/SVGPolygonElement-svgdom-requiredFeatures.js:
        (repaintTest):
        * svg/dynamic-updates/script-tests/SVGPolylineElement-dom-requiredFeatures.js:
        (repaintTest):
        * svg/dynamic-updates/script-tests/SVGPolylineElement-svgdom-requiredFeatures.js:
        (repaintTest):
        * svg/dynamic-updates/script-tests/SVGRectElement-dom-requiredFeatures.js:
        (repaintTest):
        * svg/dynamic-updates/script-tests/SVGRectElement-svgdom-requiredFeatures.js:
        (repaintTest):
        * svg/dynamic-updates/script-tests/SVGSVGElement-dom-requiredFeatures.js:
        (repaintTest):
        * svg/dynamic-updates/script-tests/SVGSVGElement-svgdom-requiredFeatures.js:
        (repaintTest):
        * svg/dynamic-updates/script-tests/SVGTextElement-dom-requiredFeatures.js:
        (repaintTest):
        * svg/dynamic-updates/script-tests/SVGTextElement-svgdom-requiredFeatures.js:
        (repaintTest):
        * svg/dynamic-updates/script-tests/SVGUseElement-dom-requiredFeatures.js:
        (repaintTest):
        * svg/dynamic-updates/script-tests/SVGUseElement-svgdom-requiredFeatures.js:
        (repaintTest):

1509
1510
1511
1512
1513
1514
1515
1516
1517
1518
1519
1520
1521
1522
1523
1524
1525
1526
1527
1528
2013-08-09  Simon Fraser  <simon.fraser@apple.com>

        move-by-word-visually-multi-space.html takes 21s and spends most of its time doing spelling and grammar checking
        https://bugs.webkit.org/show_bug.cgi?id=119613

        Reviewed by Darin Adler.
        
        editing/selection tests are very slow, and much of the time is spent
        doing spelling and grammar checking (which is not what these tests are
        testing). So call internals.setContinuousSpellCheckingEnabled(false)
        to turn that off.

        * editing/selection/caret-at-bidi-boundary.html:
        * editing/selection/move-by-character-brute-force.html:
        * editing/selection/move-left-right.html:
        * editing/selection/programmatic-selection-on-mac-is-directionless.html:
        * editing/selection/resources/extend-selection.js:
        * editing/selection/resources/move-by-word-visually.js:
        (runTest):

1529
1530
1531
1532
1533
1534
1535
1536
1537
1538
1539
1540
1541
1542
1543
2013-08-09  Bruno de Oliveira Abinader  <bruno.d@partner.samsung.com>

        Text decorations should be listed as non-inheritable
        https://bugs.webkit.org/show_bug.cgi?id=119608

        Reviewed by Andreas Kling.

        Added test to verify that 'text-decoration' and 'text-decoration-line'
        properties are not implicitly inherited.

        * fast/css/getComputedStyle/getComputedStyle-text-decoration-expected.txt:
        * fast/css/getComputedStyle/script-tests/getComputedStyle-text-decoration.js:
        * fast/css3-text/css3-text-decoration/getComputedStyle/getComputedStyle-text-decoration-line-expected.txt:
        * fast/css3-text/css3-text-decoration/getComputedStyle/script-tests/getComputedStyle-text-decoration-line.js:

1544
1545
1546
1547
1548
1549
1550
1551
1552
1553
1554
1555
2013-08-09  Zoltan Arvai  <zarvai@inf.u-szeged.hu>

        [Qt] Unreviewed gardening. Rebaselinnig some new tests.

        * platform/qt-5.0-wk1/TestExpectations:
        * platform/qt-5.0-wk2/compositing/overflow-trumps-transform-style-expected.txt:
        * platform/qt-5.0-wk2/fast/repaint/caret-jump-between-nodes-expected.txt: Added.
        * platform/qt/compositing/geometry/preserve-3d-switching-expected.txt:
        * platform/qt/fast/forms/search-rtl-expected.png:
        * platform/qt/fast/forms/search-rtl-expected.txt:
        * platform/qt/fast/repaint/caret-jump-between-nodes-expected.txt: Added.

1556
1557
1558
1559
1560
1561
1562
1563
1564
1565
1566
1567
1568
1569
1570
1571
2013-08-09  Rob Buis  <rwlbuis@webkit.org>

        ASSERT_NOT_REACHED() touched in WebCore::SVGAnimatedStringAnimator::addAnimatedTypes
        https://bugs.webkit.org/show_bug.cgi?id=113224

        Reviewed by Dirk Schulze.

        Add a test for animating non-additive attributes in from-by animations

        * svg/animations/non-additive-type-from-by-animation-expected.txt: Added.
        * svg/animations/non-additive-type-from-by-animation.html: Added.
        * svg/animations/resources/non-additive-type-from-by-animation.svg: Added.
        * svg/animations/script-tests/non-additive-type-from-by-animation.js: Added.
        (sample):
        (executeTest):

1572
1573
1574
1575
1576
1577
1578
1579
1580
1581
1582
1583
2013-08-09  Rob Buis  <rwlbuis@webkit.org>

        ASSERT(m_type == toSVGTransform.type())
        https://bugs.webkit.org/show_bug.cgi?id=113217

        Reviewed by Darin Adler.

        Add reftest for additive to animation where from and to transform types differ.

        * svg/animations/animateTransform-to-scale-expected.svg: Added.
        * svg/animations/animateTransform-to-scale.svg: Added.

1584
1585
1586
1587
1588
1589
1590
1591
1592
1593
2013-08-09  Renata Hodovan  <reni@webkit.org>

        Missing NULL check in ApplyStyleCommand::applyInlineStyleToNodeRange()
        https://bugs.webkit.org/show_bug.cgi?id=119570

        Reviewed by Ryosuke Niwa.

        * editing/execCommand/null-style-crash-expected.txt: Added.
        * editing/execCommand/null-style-crash.html: Added.

1594
1595
1596
1597
1598
1599
1600
1601
1602
1603
1604
1605
1606
1607
2013-08-08  Tim Horton  <timothy_horton@apple.com>

        navigator.plugins has plugins in it when plugins are disabled
        https://bugs.webkit.org/show_bug.cgi?id=119607
        <rdar://problem/14678030>

        Reviewed by Anders Carlsson.

        Add a test that ensures that navigator.plugins only contains
        application plugins when plugins are disabled.

        * plugins/navigator-plugins-disabled-expected.txt: Added.
        * plugins/navigator-plugins-disabled.html: Added.

1608
1609
1610
1611
1612
1613
1614
1615
1616
1617
1618
1619
1620
1621
1622
1623
1624
1625
1626
1627
1628
1629
1630
2013-08-08  Timothy Hatcher  <timothy@apple.com>

        Allow SVG images to be drawn into canvas without tainting.
        https://bugs.webkit.org/show_bug.cgi?id=119492

        Reviewed by Darin Adler.

        * fast/canvas/svg-taint-expected.txt: Removed.
        * fast/canvas/svg-taint.html: Removed. Obsolete.
        * http/tests/security/canvas-remote-read-data-url-svg-image-expected.txt: Removed.
        * http/tests/security/canvas-remote-read-data-url-svg-image.html: Removed. Obsolete.
        * http/tests/security/canvas-remote-read-svg-image-expected.txt: Removed.
        * http/tests/security/canvas-remote-read-svg-image.html: Removed. Obsolete.
        * svg/as-image/resources/link-xhtml-svg.svg: Added.
        * svg/as-image/resources/link-xhtml.svg: Added.
        * svg/as-image/resources/link.svg: Added.
        * svg/as-image/svg-canvas-link-not-colored-expected.txt: Added.
        * svg/as-image/svg-canvas-link-not-colored.html: Added.
        * svg/as-image/svg-canvas-not-tainted-expected.txt: Added.
        * svg/as-image/svg-canvas-not-tainted.html: Added.
        * svg/as-image/svg-canvas-xhtml-tainted-expected.txt: Added.
        * svg/as-image/svg-canvas-xhtml-tainted.html: Added.

1631
1632
1633
1634
1635
1636
1637
1638
1639
1640
1641
1642
1643
1644
2013-08-08  Commit Queue  <commit-queue@webkit.org>

        Unreviewed, rolling out r153847.
        http://trac.webkit.org/changeset/153847
        https://bugs.webkit.org/show_bug.cgi?id=119609

        caused new SVG animation test failures (Requested by smfr on
        #webkit).

        * svg/animations/non-additive-type-from-by-animation-expected.txt: Removed.
        * svg/animations/non-additive-type-from-by-animation.html: Removed.
        * svg/animations/resources/non-additive-type-from-by-animation.svg: Removed.
        * svg/animations/script-tests/non-additive-type-from-by-animation.js: Removed.

1645
1646
1647
1648
1649
1650
1651
2013-08-08  Jer Noble  <jer.noble@apple.com>

        Unreviewed gardening; update test after addKey() was renamed to update().

        * media/encrypted-media/encrypted-media-v2-events-expected.txt:
        * media/encrypted-media/encrypted-media-v2-events.html:

1652
1653
1654
1655
1656
1657
1658
1659
1660
1661
1662
1663
1664
1665
1666
1667
1668
1669
2013-08-08  Jer Noble  <jer.noble@apple.com>

        [EME] MediaKey APIs should be prefixed.
        https://bugs.webkit.org/show_bug.cgi?id=119606

        Reviewed by Anders Carlsson.

        * media/encrypted-media/encrypted-media-constants-expected.txt:
        * media/encrypted-media/encrypted-media-constants.html:
        * media/encrypted-media/encrypted-media-events-expected.txt:
        * media/encrypted-media/encrypted-media-events.html:
        * media/encrypted-media/encrypted-media-is-type-supported-expected.txt:
        * media/encrypted-media/encrypted-media-is-type-supported.html:
        * media/encrypted-media/encrypted-media-v2-events-expected.txt:
        * media/encrypted-media/encrypted-media-v2-events.html:
        * media/encrypted-media/encrypted-media-v2-syntax-expected.txt:
        * media/encrypted-media/encrypted-media-v2-syntax.html:

1670
1671
1672
1673
1674
1675
1676
1677
2013-08-08  Tim Horton  <timothy_horton@apple.com>

        Unreviewed, remove TestExpectations for removed microdata tests.

        * platform/mac/TestExpectations:
        * platform/qt/TestExpectations:
        * platform/win/TestExpectations:

1678
1679
1680
1681
1682
1683
1684
1685
1686
1687
1688
1689
1690
1691
2013-08-08  Alexey Proskuryakov  <ap@apple.com>

        [WK2] loader/go-back-cached-main-resource.html fails
        https://bugs.webkit.org/show_bug.cgi?id=116491

        Reviewed by Tim Horton.

        * platform/wk2/TestExpectations:
        * webarchive/loading/test-loading-archive-subresource-null-mimetype-expected.txt:
        Updated to not have file:// in results. This may not be desirable for a webarchive
        test, but shouldn't be too bad either.
        * platform/mac-wk2/loader/go-back-cached-main-resource-expected.txt: Deleted.
        Cross-platform results now work.

1692
1693
1694
1695
1696
1697
1698
1699
1700
1701
2013-08-08  Jer Noble  <jer.noble@apple.com>

        [EME] setMediaKeys function as defined in the EME specification does not work
        https://bugs.webkit.org/show_bug.cgi?id=119597

        Reviewed by Anders Carlsson.

        * media/encrypted-media/encrypted-media-v2-syntax-expected.txt:
        * media/encrypted-media/encrypted-media-v2-syntax.html:

1702
1703
1704
1705
1706
1707
1708
1709
1710
1711
1712
1713
1714
1715
1716
1717
2013-08-08  Rob Buis  <rwlbuis@webkit.org>

        ASSERT_NOT_REACHED() touched in WebCore::SVGAnimatedStringAnimator::addAnimatedTypes
        https://bugs.webkit.org/show_bug.cgi?id=113224

        Reviewed by Dirk Schulze.

        Add a test for animating non-additive attributes in from-by animations

        * svg/animations/non-additive-type-from-by-animation-expected.txt: Added.
        * svg/animations/non-additive-type-from-by-animation.html: Added.
        * svg/animations/resources/non-additive-type-from-by-animation.svg: Added.
        * svg/animations/script-tests/non-additive-type-from-by-animation.js: Added.
        (sample):
        (executeTest):

1718
1719
1720
1721
1722
1723
1724
1725
1726
2013-08-08  Eric Carlson  <eric.carlson@apple.com>

        fullscreen/exit-full-screen-iframe.html is failing
        https://bugs.webkit.org/show_bug.cgi?id=90708

        Unreviewed gardening.

        * platform/mac/TestExpectations: Mark test as flakey, it doesn't always pass.

1727
1728
1729
1730
1731
1732
1733
1734
1735
2013-08-08  Eric Carlson  <eric.carlson@apple.com>

        fast/events/scroll-div-with-prevent-default-in-subframe.html is failing
        https://bugs.webkit.org/show_bug.cgi?id=82747

        Unreviewed gardening.

        * platform/mac/TestExpectations: Mark test as flakey, it doesn't always pass.

1736
1737
1738
1739
1740
1741
1742
1743
1744
2013-08-08  Eric Carlson  <eric.carlson@apple.com>

        http/tests/navigation/back-twice-without-commit.html is flaky
        https://bugs.webkit.org/show_bug.cgi?id=82980

        Unreviewed gardening.

        * platform/mac/TestExpectations: Unskip passing test.

1745
1746
1747
1748
1749
1750
1751
1752
1753
2013-08-08  Eric Carlson  <eric.carlson@apple.com>

        Layout Test fast/overflow/scrollbar-click-retains-focus.html is failing on Apple Mac WK1 and GTK.
        https://bugs.webkit.org/show_bug.cgi?id=104104

        Unreviewed gardening.

        * platform/mac/TestExpectations: Unskip passing test.

1754
1755
1756
1757
1758
1759
1760
1761
1762
1763
2013-08-08  Jer Noble  <jer.noble@apple.com>

        [EME] Implement MediaKeys.isTypeSupported()
        https://bugs.webkit.org/show_bug.cgi?id=119586

        Reviewed by Eric Carlson.

        * media/encrypted-media/encrypted-media-is-type-supported-expected.txt: Added.
        * media/encrypted-media/encrypted-media-is-type-supported.html: Added.

1764
1765
1766
1767
1768
1769
1770
1771
1772
2013-08-08  Eric Carlson  <eric.carlson@apple.com>

        fast/events/scroll-div-with-prevent-default-in-subframe.html is failing
        https://bugs.webkit.org/show_bug.cgi?id=82747

        Unreviewed gardening.

        * platform/mac/TestExpectations: Unskip passing test.

1773
1774
1775
1776
1777
1778
1779
1780
1781
2013-08-08  Eric Carlson  <eric.carlson@apple.com>

        REGRESSION(r130839): fast/canvas/webgl/arraybuffer-transfer-of-control.html is failing
        https://bugs.webkit.org/show_bug.cgi?id=99096

        Unreviewed gardening.

        * platform/mac/TestExpectations: Unskip passing test.

1782
1783
1784
1785
1786
1787
1788
1789
1790
2013-08-08  Eric Carlson  <eric.carlson@apple.com>

        fullscreen/exit-full-screen-iframe.html is failing
        https://bugs.webkit.org/show_bug.cgi?id=90708

        Unreviewed gardening.

        * platform/mac/TestExpectations: Unskip passing test.

1791
1792
1793
1794
1795
1796
1797
1798
1799
1800
1801
1802
2013-08-08  Rob Buis  <rwlbuis@webkit.org>

        Crash in WTF::RefPtr<WebCore::SpaceSplitStringData>::operator UnspecifiedBoolType
        https://bugs.webkit.org/show_bug.cgi?id=118839

        Reviewed by Darin Adler.

        Add testcase that showed up to cause a crash by the fuzzer.

        * svg/animations/classAttributeSettingCrash-expected.txt: Added.
        * svg/animations/classAttributeSettingCrash.html: Added.

1803
1804
1805
1806
1807
1808
1809
1810
1811
1812
1813
1814
1815
1816
1817
1818
2013-08-08  Rob Buis  <rwlbuis@webkit.org>

        svg/custom/use-href-update-crash.svg failing on certain platforms
        https://bugs.webkit.org/show_bug.cgi?id=104054

        Reviewed by Darin Adler.

        Fix mistake in use-href-update-crash.svg which caused the gc() not found problem. Update the test expectations
        that had this marked as failure, it passes after the test fix.

        * platform/gtk/TestExpectations:
        * platform/mac/TestExpectations:
        * platform/qt/TestExpectations:
        * platform/win/TestExpectations:
        * svg/custom/use-href-update-crash.svg:

1819
1820
1821
1822
1823
1824
1825
1826
2013-08-08  Alexey Proskuryakov  <ap@apple.com>

        WTR::pathSuitableForTestResult should behave the same as _drt_descriptionSuitableForTestResult so we can unskip tests.
        https://bugs.webkit.org/show_bug.cgi?id=116125

        * platform/wk2/TestExpectations: Removed a test that now passes, added one that fails
        (will look into that separately).

1827
1828
1829
1830
1831
1832
1833
1834
1835
1836
1837
1838
1839
1840
1841
2013-08-08  Zalan Bujtas  <zalan@apple.com>

        REGRESSION (r121551) Incorrect handling of invalid media query list.
        https://bugs.webkit.org/show_bug.cgi?id=119164

        Reviewed by Antti Koivisto.

        Differentiate between syntactically invalid media queries and media queries with empty expressions.

        Introduce a dedicated function for valid, but empty expression queries, so that passing NULL MediaQuerySet
        object to CSSParser::createMediaRule() can indicate invalid media query.

        * fast/media/invalid-media-query-list-expected.html: Added.
        * fast/media/invalid-media-query-list.html: Added.

1842
1843
1844
1845
1846
1847
1848
1849
1850
1851
1852
1853
1854
1855
1856
1857
1858
1859
1860
1861
1862
1863
1864
1865
1866
1867
1868
1869
1870
1871
1872
2013-08-08  Zoltan Arvai  <zarvai@inf.u-szeged.hu>

        [Qt] Unreviewed rebaselining after r153647.

        * platform/qt/fast/css/input-search-padding-expected.png:
        * platform/qt/fast/css/input-search-padding-expected.txt:
        * platform/qt/fast/css/text-overflow-input-expected.png:
        * platform/qt/fast/css/text-overflow-input-expected.txt:
        * platform/qt/fast/forms/box-shadow-override-expected.png:
        * platform/qt/fast/forms/box-shadow-override-expected.txt:
        * platform/qt/fast/forms/control-restrict-line-height-expected.png:
        * platform/qt/fast/forms/control-restrict-line-height-expected.txt:
        * platform/qt/fast/forms/placeholder-position-expected.png:
        * platform/qt/fast/forms/placeholder-position-expected.txt:
        * platform/qt/fast/forms/placeholder-pseudo-style-expected.png:
        * platform/qt/fast/forms/placeholder-pseudo-style-expected.txt:
        * platform/qt/fast/forms/search-cancel-button-style-sharing-expected.png:
        * platform/qt/fast/forms/search-cancel-button-style-sharing-expected.txt:
        * platform/qt/fast/forms/search-display-none-cancel-button-expected.png:
        * platform/qt/fast/forms/search-display-none-cancel-button-expected.txt:
        * platform/qt/fast/forms/search-rtl-expected.png:
        * platform/qt/fast/forms/search-rtl-expected.txt:
        * platform/qt/fast/forms/search-styled-expected.png:
        * platform/qt/fast/forms/search-styled-expected.txt:
        * platform/qt/fast/forms/search-vertical-alignment-expected.png:
        * platform/qt/fast/forms/search-vertical-alignment-expected.txt:
        * platform/qt/fast/forms/search/search-size-with-decorations-expected.png: Added.
        * platform/qt/fast/forms/search/search-size-with-decorations-expected.txt: Added.
        * platform/qt/fast/repaint/search-field-cancel-expected.png:
        * platform/qt/fast/repaint/search-field-cancel-expected.txt:

1873
1874
1875
1876
1877
1878
1879
1880
1881
2013-08-08  Allan Sandfeld Jensen  <allan.jensen@digia.com>

        [Qt] Skip more tests depending on canvas blending.
        https://bugs.webkit.org/show_bug.cgi?id=100072

        Unreviewed gardening.

        * platform/qt/TestExpectations:

1882
1883
1884
1885
1886
1887
1888
1889
1890
1891
1892
2013-08-08  Andreas Kling  <akling@apple.com>

        REGRESSION(r139282): Old caret sometimes gets "stuck" (not repainted) in contenteditable elements.
        <http://webkit.org/b/119520>
        <rdar://problem/14658929>

        Reviewed by Simon Fraser.

        * fast/repaint/caret-jump-between-nodes-expected.txt: Added.
        * fast/repaint/caret-jump-between-nodes.html: Added.

1893
1894
1895
1896
1897
1898
1899
1900
1901
1902
1903
1904
1905
1906
1907
1908
1909
1910
1911
1912
1913
1914
1915
2013-08-07  Andrei Bucur  <abucur@adobe.com>

        [CSS Regions] Propagate overflow from the flow thread to the first and last region
        https://bugs.webkit.org/show_bug.cgi?id=118526

        Reviewed by David Hyatt.

        Add tests for scrolling of regions in containers in different situations: regions with
        transforms, nested regions, regions affected by scrollbars etc.

        * fast/regions/overflow-scrollable-1-expected.html: Added.
        * fast/regions/overflow-scrollable-1.html: Added.
        * fast/regions/overflow-scrollable-2-expected.html: Added.
        * fast/regions/overflow-scrollable-2.html: Added.
        * fast/regions/overflow-scrollable-3-expected.html: Added.
        * fast/regions/overflow-scrollable-3.html: Added.
        * fast/regions/overflow-scrollable-fit-complex-expected.html: Added.
        * fast/regions/overflow-scrollable-fit-complex.html: Added.
        * fast/regions/overflow-scrollable-fit-expected.html: Added.
        * fast/regions/overflow-scrollable-fit.html: Added.
        * fast/regions/overflow-scrollable-nested-expected.txt: Added.
        * fast/regions/overflow-scrollable-nested.html: Added.

1916
1917
1918
1919
1920
1921
1922
1923
1924
1925
1926
1927
1928
1929
2013-08-07  Tim Horton  <timothy_horton@apple.com>

        Fall out of simple image layer optimization if the image has EXIF rotation
        https://bugs.webkit.org/show_bug.cgi?id=119535
        <rdar://problem/14071174>

        Reviewed by Simon Fraser.

        Add a test that ensures that composited images with EXIF orientation paint correctly.

        * fast/images/exif-orientation-composited-expected.txt: Added.
        * fast/images/exif-orientation-composited.html: Added.
        * platform/mac/fast/images/exif-orientation-composited-expected.png: Added.

1930
1931
1932
1933
1934
1935
1936
1937
2013-08-07  Allan Sandfeld Jensen  <allan.jensen@digia.com>

        [Qt] Skip background-blending-mode tests

        Unreviewed gardening.

        * platform/qt/TestExpectations:

1938
1939
1940
1941
1942
1943
1944
1945
1946
1947
1948
2013-08-07  Antti Koivisto  <antti@apple.com>

        2.5% regression on page cycler moz
        https://bugs.webkit.org/show_bug.cgi?id=102822

        Reviewed by Andreas Kling.
        
        This is a progression.

        * inspector/timeline/timeline-script-tag-1-expected.txt:

1949
1950
1951
1952
1953
1954
1955
1956
1957
1958
1959
1960
1961
1962
1963
1964
1965
1966
1967
1968
1969
1970
1971
1972
1973
2013-08-07  Mirela Budaes  <mbudaes@adobe.com>

        [CSS Blending] Add test suite to validate background blending with different properties
        https://bugs.webkit.org/show_bug.cgi?id=118243

        Reviewed by Dirk Schulze.

        * css3/compositing/background-blend-mode-background-attachement-fixed-expected.html: Added.
        * css3/compositing/background-blend-mode-background-attachement-fixed.html: Added.
        * css3/compositing/background-blend-mode-background-clip-content-box-expected.html: Added.
        * css3/compositing/background-blend-mode-background-clip-content-box.html: Added.
        * css3/compositing/background-blend-mode-background-clip-padding-box-expected.html: Added.
        * css3/compositing/background-blend-mode-background-clip-padding-box.html: Added.
        * css3/compositing/background-blend-mode-background-origin-border-box-expected.html: Added.
        * css3/compositing/background-blend-mode-background-origin-border-box.html: Added.
        * css3/compositing/background-blend-mode-background-position-percentage-expected.html: Added.
        * css3/compositing/background-blend-mode-background-position-percentage.html: Added.
        * css3/compositing/background-blend-mode-background-repeat-no-repeat-expected.html: Added.
        * css3/compositing/background-blend-mode-background-repeat-no-repeat.html: Added.
        * css3/compositing/background-blend-mode-background-size-contain-expected.html: Added.
        * css3/compositing/background-blend-mode-background-size-contain.html: Added.
        * css3/compositing/background-blend-mode-background-size-cover-expected.html: Added.
        * css3/compositing/background-blend-mode-background-size-cover.html: Added.
        * css3/compositing/resources/white_square.svg: Added.

1974
1975
1976
1977
1978
1979
1980
1981
1982
1983
2013-08-07  Mihnea Ovidenie  <mihnea@adobe.com>

        [CSSRegions] Wrong auto-height region computation for nested named flows
        https://bugs.webkit.org/show_bug.cgi?id=119517

        Reviewed by David Hyatt.

        * fast/regions/abspos-autoheight-nested-region-expected.txt: Added.
        * fast/regions/abspos-autoheight-nested-region.html: Added.

1984
1985
1986
1987
1988
1989
1990
1991
1992
1993
1994
2013-08-07  Krzysztof Czech  <k.czech@samsung.com>

        [EFL] REGRESSION after r153432: marking crashing tests.
        https://bugs.webkit.org/show_bug.cgi?id=119539

        Unreviewed EFL gardening.

        * platform/efl-wk1/TestExpectations:
        * platform/efl-wk2/TestExpectations:
        * platform/efl/TestExpectations:

1995
1996
1997
1998
1999
2000
2001
2002
2003
2004
2005
2006
2007
2008
2013-08-06  Filip Pizlo  <fpizlo@apple.com>

        DFG FixupPhase should insert Int32ToDouble nodes for number uses in NewArray, and SpeculativeJIT 64-bit should not try to coerce integer constants to double constants
        https://bugs.webkit.org/show_bug.cgi?id=119528

        Reviewed by Geoffrey Garen.

        * fast/js/dfg-new-array-double-const-then-int-const.html: Added.
        * fast/js/dfg-new-array-double-const-then-int-const-expected.txt: Added.
        * fast/js/jsc-test-list:
        * fast/js/script-tests/dfg-new-array-double-const-then-int-const.js: Added.
        (bar):
        (foo):

2009
2010
2011
2012
2013
2014
2015
2016
2017
2018
2019
2020
2021
2022
2023
2024
2025
2026
2027
2028
2029
2030
2031
2032
2033
2034
2035
2036
2037
2038
2039
2040
2041
2042
2043
2044
2045
2046
2047
2048
2049
2050
2051
2052
2053
2054
2055
2056
2057
2058
2059
2060
2061
2062
2063
2064
2065
2066
2067
2068
2069
2070
2071
2072
2073
2074
2075
2076
2077
2078
2079
2080
2081
2082
2083
2084
2085
2086
2087
2088
2089
2090
2091
2092
2093
2094
2095
2096
2097
2098
2099
2100
2101
2102
2103
2104
2105
2106
2107
2108
2109
2110
2111
2112
2113
2114
2115
2116
2117
2118
2119
2120
2121
2122
2123
2124
2125
2126
2127
2128
2129
2130
2131
2132
2133
2134
2135
2136
2137
2138
2139
2140
2141
2142
2143
2144
2145
2146
2147
2148
2149
2150
2151
2152
2153
2154
2155
2156
2157
2013-08-04  Sam Weinig  <sam@webkit.org>

        Remove support for HTML5 MicroData
        https://bugs.webkit.org/show_bug.cgi?id=119480

        Reviewed by Anders Carlsson.

        * fast/dom/MicroData: Removed.
        * fast/dom/MicroData/001-expected.txt: Removed.
        * fast/dom/MicroData/001.html: Removed.
        * fast/dom/MicroData/002-expected.txt: Removed.
        * fast/dom/MicroData/002.html: Removed.
        * fast/dom/MicroData/003-expected.txt: Removed.
        * fast/dom/MicroData/003.html: Removed.
        * fast/dom/MicroData/004-expected.txt: Removed.
        * fast/dom/MicroData/004.html: Removed.
        * fast/dom/MicroData/005-expected.txt: Removed.
        * fast/dom/MicroData/005.html: Removed.
        * fast/dom/MicroData/006-expected.txt: Removed.
        * fast/dom/MicroData/006.html: Removed.
        * fast/dom/MicroData/007-expected.txt: Removed.
        * fast/dom/MicroData/007.html: Removed.
        * fast/dom/MicroData/008-expected.txt: Removed.
        * fast/dom/MicroData/008.html: Removed.
        * fast/dom/MicroData/009-expected.txt: Removed.
        * fast/dom/MicroData/009.html: Removed.
        * fast/dom/MicroData/add-remove-property-to-item-which-is-not-attached-to-domtree-expected.txt: Removed.
        * fast/dom/MicroData/add-remove-property-to-item-which-is-not-attached-to-domtree.html: Removed.
        * fast/dom/MicroData/domsettabletokenlist-attributes-add-token-expected.txt: Removed.
        * fast/dom/MicroData/domsettabletokenlist-attributes-add-token.html: Removed.
        * fast/dom/MicroData/domsettabletokenlist-attributes-out-of-range-index-expected.txt: Removed.
        * fast/dom/MicroData/domsettabletokenlist-attributes-out-of-range-index.html: Removed.
        * fast/dom/MicroData/element-with-empty-itemprop-expected.txt: Removed.
        * fast/dom/MicroData/element-with-empty-itemprop.html: Removed.
        * fast/dom/MicroData/getitems-empty-string-as-arg-expected.txt: Removed.
        * fast/dom/MicroData/getitems-empty-string-as-arg.html: Removed.
        * fast/dom/MicroData/getitems-multiple-itemtypes-expected.txt: Removed.
        * fast/dom/MicroData/getitems-multiple-itemtypes.html: Removed.
        * fast/dom/MicroData/item-not-attached-to-domtree-expected.txt: Removed.
        * fast/dom/MicroData/item-not-attached-to-domtree.html: Removed.
        * fast/dom/MicroData/item-with-itemprop-attr-expected.txt: Removed.
        * fast/dom/MicroData/item-with-itemprop-attr.html: Removed.
        * fast/dom/MicroData/item-with-itemref-pointing-to-itself-expected.txt: Removed.
        * fast/dom/MicroData/item-with-itemref-pointing-to-itself.html: Removed.
        * fast/dom/MicroData/itemid-attribute-test-001-expected.txt: Removed.
        * fast/dom/MicroData/itemid-attribute-test-001.html: Removed.
        * fast/dom/MicroData/itemid-attribute-test-expected.txt: Removed.
        * fast/dom/MicroData/itemid-attribute-test.html: Removed.
        * fast/dom/MicroData/itemid-must-see-resolved-url-expected.txt: Removed.
        * fast/dom/MicroData/itemid-must-see-resolved-url.html: Removed.
        * fast/dom/MicroData/itemprop-add-remove-tokens-expected.txt: Removed.
        * fast/dom/MicroData/itemprop-add-remove-tokens.html: Removed.
        * fast/dom/MicroData/itemprop-for-an-element-must-be-correct-expected.txt: Removed.
        * fast/dom/MicroData/itemprop-for-an-element-must-be-correct.html: Removed.
        * fast/dom/MicroData/itemprop-must-be-read-only-expected.txt: Removed.
        * fast/dom/MicroData/itemprop-must-be-read-only.html: Removed.
        * fast/dom/MicroData/itemprop-names-override-builtin-properties-expected.txt: Removed.
        * fast/dom/MicroData/itemprop-names-override-builtin-properties.html: Removed.
        * fast/dom/MicroData/itemprop-reflected-by-itemProp-property-expected.txt: Removed.
        * fast/dom/MicroData/itemprop-reflected-by-itemProp-property.html: Removed.
        * fast/dom/MicroData/itemref-add-remove-tokens-expected.txt: Removed.
        * fast/dom/MicroData/itemref-add-remove-tokens.html: Removed.
        * fast/dom/MicroData/itemref-attribute-reflected-by-itemRef-property-expected.txt: Removed.
        * fast/dom/MicroData/itemref-attribute-reflected-by-itemRef-property.html: Removed.
        * fast/dom/MicroData/itemref-for-an-element-must-be-correct-expected.txt: Removed.
        * fast/dom/MicroData/itemref-for-an-element-must-be-correct.html: Removed.
        * fast/dom/MicroData/itemref-must-be-read-only-expected.txt: Removed.
        * fast/dom/MicroData/itemref-must-be-read-only.html: Removed.
        * fast/dom/MicroData/itemref-pointing-to-root-node-expected.txt: Removed.
        * fast/dom/MicroData/itemref-pointing-to-root-node.html: Removed.
        * fast/dom/MicroData/itemref-refers-first-element-with-given-id-expected.txt: Removed.
        * fast/dom/MicroData/itemref-refers-first-element-with-given-id.html: Removed.
        * fast/dom/MicroData/itemscope-attribute-test-expected.txt: Removed.
        * fast/dom/MicroData/itemscope-attribute-test.html: Removed.
        * fast/dom/MicroData/itemscope-must-be-read-write-expected.txt: Removed.
        * fast/dom/MicroData/itemscope-must-be-read-write.html: Removed.
        * fast/dom/MicroData/itemtype-add-remove-tokens-expected.txt: Removed.
        * fast/dom/MicroData/itemtype-add-remove-tokens.html: Removed.
        * fast/dom/MicroData/itemtype-attribute-test-expected.txt: Removed.
        * fast/dom/MicroData/itemtype-attribute-test.html: Removed.
        * fast/dom/MicroData/itemvalue-reflects-data-attr-on-object-element-expected.txt: Removed.
        * fast/dom/MicroData/itemvalue-reflects-data-attr-on-object-element.html: Removed.
        * fast/dom/MicroData/itemvalue-reflects-href-attr-expected.txt: Removed.
        * fast/dom/MicroData/itemvalue-reflects-href-attr.html: Removed.
        * fast/dom/MicroData/itemvalue-reflects-src-attribute-on-img-element-expected.txt: Removed.
        * fast/dom/MicroData/itemvalue-reflects-src-attribute-on-img-element.html: Removed.
        * fast/dom/MicroData/itemvalue-reflects-the-content-attr-on-meta-element-expected.txt: Removed.
        * fast/dom/MicroData/itemvalue-reflects-the-content-attr-on-meta-element.html: Removed.
        * fast/dom/MicroData/itemvalue-reflects-the-src-attr-expected.txt: Removed.
        * fast/dom/MicroData/itemvalue-reflects-the-src-attr.html: Removed.
        * fast/dom/MicroData/itemvalue-returns-element-itself-expected.txt: Removed.
        * fast/dom/MicroData/itemvalue-returns-element-itself.html: Removed.
        * fast/dom/MicroData/itemvalue-returns-null-expected.txt: Removed.
        * fast/dom/MicroData/itemvalue-returns-null.html: Removed.
        * fast/dom/MicroData/itemvalue-throws-excpetion-onsetting-001-expected.txt: Removed.
        * fast/dom/MicroData/itemvalue-throws-excpetion-onsetting-001.html: Removed.
        * fast/dom/MicroData/itemvalue-throws-excpetion-onsetting-002-expected.txt: Removed.
        * fast/dom/MicroData/itemvalue-throws-excpetion-onsetting-002.html: Removed.
        * fast/dom/MicroData/microdata-domtokenlist-attribute-add-remove-tokens-expected.txt: Removed.
        * fast/dom/MicroData/microdata-domtokenlist-attribute-add-remove-tokens.html: Removed.
        * fast/dom/MicroData/nameditem-must-be-case-sensitive-expected.txt: Removed.
        * fast/dom/MicroData/nameditem-must-be-case-sensitive.html: Removed.
        * fast/dom/MicroData/nameditem-must-return-correct-item-properties-expected.txt: Removed.
        * fast/dom/MicroData/nameditem-must-return-correct-item-properties.html: Removed.
        * fast/dom/MicroData/nameditem-returns-propertynodelist-expected.txt: Removed.
        * fast/dom/MicroData/nameditem-returns-propertynodelist.html: Removed.
        * fast/dom/MicroData/names-item-out-of-range-index-expected.txt: Removed.
        * fast/dom/MicroData/names-item-out-of-range-index.html: Removed.
        * fast/dom/MicroData/names-property-must-be-correct-expected.txt: Removed.
        * fast/dom/MicroData/names-property-must-be-correct.html: Removed.
        * fast/dom/MicroData/names-property-test-expected.txt: Removed.
        * fast/dom/MicroData/names-property-test.html: Removed.
        * fast/dom/MicroData/properties-collection-add-remove-itemref-expected.txt: Removed.
        * fast/dom/MicroData/properties-collection-add-remove-itemref.html: Removed.
        * fast/dom/MicroData/properties-collection-add-remove-property-expected.txt: Removed.
        * fast/dom/MicroData/properties-collection-add-remove-property.html: Removed.
        * fast/dom/MicroData/properties-collection-behavior-add-remove-itemscope-attr-expected.txt: Removed.
        * fast/dom/MicroData/properties-collection-behavior-add-remove-itemscope-attr.html: Removed.
        * fast/dom/MicroData/properties-collection-must-be-correct-expected.txt: Removed.
        * fast/dom/MicroData/properties-collection-must-be-correct.html: Removed.
        * fast/dom/MicroData/properties-collection-must-ignore-properties-of-nested-items-expected.txt: Removed.
        * fast/dom/MicroData/properties-collection-must-ignore-properties-of-nested-items.html: Removed.
        * fast/dom/MicroData/properties-collection-must-see-the-properties-added-in-itemref-expected.txt: Removed.
        * fast/dom/MicroData/properties-collection-must-see-the-properties-added-in-itemref.html: Removed.
        * fast/dom/MicroData/properties-collection-namedgetter-with-invalid-name-expected.txt: Removed.
        * fast/dom/MicroData/properties-collection-namedgetter-with-invalid-name.html: Removed.
        * fast/dom/MicroData/properties-collection-nameditem-test-expected.txt: Removed.
        * fast/dom/MicroData/properties-collection-nameditem-test.html: Removed.
        * fast/dom/MicroData/properties-collection-test-expected.txt: Removed.
        * fast/dom/MicroData/properties-collection-test.html: Removed.
        * fast/dom/MicroData/propertiescollection-crash-expected.txt: Removed.
        * fast/dom/MicroData/propertiescollection-crash.html: Removed.
        * fast/dom/MicroData/propertiescollection-on-changing-id-attr-expected.txt: Removed.
        * fast/dom/MicroData/propertiescollection-on-changing-id-attr.html: Removed.
        * fast/dom/MicroData/propertynodelist-add-remove-itemprop-tokens-expected.txt: Removed.
        * fast/dom/MicroData/propertynodelist-add-remove-itemprop-tokens.html: Removed.
        * fast/dom/MicroData/propertynodelist-add-remove-itemref-tokens-expected.txt: Removed.
        * fast/dom/MicroData/propertynodelist-add-remove-itemref-tokens.html: Removed.
        * fast/dom/MicroData/propertynodelist-crash-expected.txt: Removed.
        * fast/dom/MicroData/propertynodelist-crash.html: Removed.
        * fast/dom/MicroData/propertynodelist-getvalues-array-values-obtained-from-itemvalue-of-each-element-expected.txt: Removed.
        * fast/dom/MicroData/propertynodelist-getvalues-array-values-obtained-from-itemvalue-of-each-element.html: Removed.
        * fast/dom/MicroData/propertynodelist-getvalues-test-expected.txt: Removed.
        * fast/dom/MicroData/propertynodelist-getvalues-test.html: Removed.
        * fast/dom/MicroData/propertynodelist-test-add-remove-element-expected.txt: Removed.
        * fast/dom/MicroData/propertynodelist-test-add-remove-element.html: Removed.
        * fast/dom/MicroData/resources: Removed.
        * fast/dom/MicroData/resources/microdata-common.js: Removed.

2158
2159
2160
2161
2162
2163
2164
2165
2166
2167
2168
2169
2170
2171
2172
2173
2174
2175
2013-08-06  Hans Muller  <hmuller@adobe.com>

        [CSS Shapes] New positioning model: scripted shape-margin tests
        https://bugs.webkit.org/show_bug.cgi?id=119491

        Update some of the shape-margin tests to work with the new positioning model. Floats
        that specify shape-outside are now positioned according to their margin box, not the
        bounding box of the shape-outside shape. The tests have been revised to reflect the
        change.

        Reviewed by Alexandru Chiculita.

        * TestExpectations:
        * fast/shapes/shape-outside-floats/shape-outside-floats-diamond-margin-polygon.html:
        * fast/shapes/shape-outside-floats/shape-outside-floats-ellipse-margin-bottom.html:
        * fast/shapes/shape-outside-floats/shape-outside-floats-ellipse-margin-left.html:
        * fast/shapes/shape-outside-floats/shape-outside-floats-ellipse-margin-right.html:

2176
2177
2178
2179
2180
2181
2182
2183
2184
2185
2186
2187
2188
2189
2013-08-06  Oliver Hunt  <oliver@apple.com>

        Delay Arguments creation in strict mode
        https://bugs.webkit.org/show_bug.cgi?id=119505

        Reviewed by Geoffrey Garen.

        Add performance testcase for lazy creation of arguments in strict mode

        * fast/js/regress/delay-tear-off-arguments-strictmode-expected.txt: Added.
        * fast/js/regress/delay-tear-off-arguments-strictmode.html: Added.
        * fast/js/regress/script-tests/delay-tear-off-arguments-strictmode.js: Added.
        (bar):

2190
2191
2192
2193
2194
2195
2196
2197
2198
2199
2200
2201
2202
2203
2204
2205
2013-08-06  Bem Jones-Bey  <bjonesbe@adobe.com>

        [CSS Shapes] New positioning model: support for shape-margin
        https://bugs.webkit.org/show_bug.cgi?id=118088

        Reviewed by Alexandru Chiculita.

        Update simple shape-margin tests to work with new positioning model.
        Also move them to the CSSWG's repo.

        * TestExpectations: Remove replaced tests.
        * csswg/submitted/shapes/shape-outside/shape-outside-floats-shape-margin-000-expected.html: Renamed from LayoutTests/fast/shapes/shape-outside-floats/shape-outside-floats-left-margin-polygon-expected.html.
        * csswg/submitted/shapes/shape-outside/shape-outside-floats-shape-margin-000.html: Renamed from LayoutTests/fast/shapes/shape-outside-floats/shape-outside-floats-left-margin-polygon.html.
        * csswg/submitted/shapes/shape-outside/shape-outside-floats-shape-margin-001-expected.html: Renamed from LayoutTests/fast/shapes/shape-outside-floats/shape-outside-floats-right-margin-polygon-expected.html.
        * csswg/submitted/shapes/shape-outside/shape-outside-floats-shape-margin-001.html: Renamed from LayoutTests/fast/shapes/shape-outside-floats/shape-outside-floats-right-margin-polygon.html.

2206
2207
2208
2209
2210
2211
2212
2213
2214
2215
2216
2217
2013-08-05  Rob Buis  <rwlbuis@webkit.org>

        SVG stroke-dasharray is not animatable
        https://bugs.webkit.org/show_bug.cgi?id=118574

        Reviewed by Dirk Schulze.

        Add test for animating stroke-dasharray in addition to the original SVG tests.

        * transitions/svg-transitions-expected.txt:
        * transitions/svg-transitions.html:

2218
2219
2220
2221
2222
2223
2224
2225
2226
2227
2228
2229
2013-08-06  Sergio Villar Senin  <svillar@igalia.com>

        [CSS Grid Layout] Allow defining named grid lines on the grid element
        https://bugs.webkit.org/show_bug.cgi?id=118255

        Reviewed by Andreas Kling.

        From Blink r149798 by <jchaffraix@chromium.org>

        * fast/css-grid-layout/named-grid-line-get-set-expected.txt: Added.
        * fast/css-grid-layout/named-grid-line-get-set.html: Added.

2230
2231
2232
2233
2234
2235
2236
2237
2238
2239
2240
2241
2242
2243
2244
2245
2246
2247
2248
2013-06-26  Sergio Villar Senin  <svillar@igalia.com>

        [CSS Grid Layout] Add support for parsing <grid-line> that includes a 'span'
        https://bugs.webkit.org/show_bug.cgi?id=118051

        Reviewed by Andreas Kling.

        From Blink r148766 by <jchaffraix@chromium.org>

        Added several test cases to check that we properly parse the
        keyword 'span' in <grid-line>.

        * fast/css-grid-layout/grid-item-column-row-get-set-expected.txt:
        * fast/css-grid-layout/grid-item-column-row-get-set.html:
        * fast/css-grid-layout/grid-item-end-after-get-set-expected.txt:
        * fast/css-grid-layout/grid-item-end-after-get-set.html:
        * fast/css-grid-layout/grid-item-start-before-get-set-expected.txt:
        * fast/css-grid-layout/grid-item-start-before-get-set.html:

2249
2250
2251
2252
2253
2254
2255
2256
2257
2258
2259
2260
2261
2262
2263
2264
2265
2266
2013-06-25  Sergio Villar Senin  <svillar@igalia.com>

        [CSS Grid Layout] Rename grid placement properties
        https://bugs.webkit.org/show_bug.cgi?id=117878

        Reviewed by Andreas Kling.

        Renamed the grid placement properties to match the latest version
        of the spec. The new names are -webkit-grid-column-{start|end} and
        -webkit-grid-row-{start|end}.

        * fast/css-grid-layout/grid-item-column-row-get-set-expected.txt:
        * fast/css-grid-layout/grid-item-column-row-get-set.html:
        * fast/css-grid-layout/grid-item-end-after-get-set-expected.txt:
        * fast/css-grid-layout/grid-item-end-after-get-set.html:
        * fast/css-grid-layout/grid-item-start-before-get-set-expected.txt:
        * fast/css-grid-layout/grid-item-start-before-get-set.html:

2267
2268
2269
2270
2271
2272
2273
2274
2275
2276
2277
2278
2279
2280
2281
2282
2013-08-05  Dean Jackson  <dino@apple.com>

        Update HTMLPreloadScanner to handle img srcset
        https://bugs.webkit.org/show_bug.cgi?id=119360

        Reviewed by Sam Weinig.

        This patch is a merge of similar patches from Yoav Weiss <yoav@yoav.ws>
        and Dean Jackson.

        New test to make sure the HTML preloader takes the
        value of srcset if available.

        * fast/preloader/image-srcset-expected.txt: Added.
        * fast/preloader/image-srcset.html: Added.

2283
2284
2285
2286
2287
2288
2289
2290
2291
2292
2293
2013-08-05  Alexey Proskuryakov  <ap@apple.com>

        <rdar://problem/13128990> chunked-progress-event-expectedLength.html is flaky on Mac
        https://bugs.webkit.org/show_bug.cgi?id=119498

        Reviewed by Brady Eidson.

        * http/tests/xmlhttprequest/resources/chunked-transfer.php: This test relies on
        length not being known upfront, which is not the case when the resource is served
        form cache.

2294
2295
2296
2297
2298
2299
2300
2301
2302
2303
2304
2305
2306
2307
2013-08-05  Alexey Proskuryakov  <ap@apple.com>

        <rdar://problem/14637103> REGRESSION (r153060?): Microphone appears in the way
        of text when dictating an e-mail
        https://bugs.webkit.org/show_bug.cgi?id=119496

        Reviewed by Ryosuke Niwa.

        * platform/mac/editing/input/firstrectforcharacterrange-caret-in-br-expected.txt: Added.
        * platform/mac/editing/input/firstrectforcharacterrange-caret-in-br.html: Added.

        * platform/wk2/TestExpectations: textInputController.firstRectForCharacterRange is
        not available in WTR.

2308
2309
2310
2311
2312
2313
2314
2315
2316
2317
2318
2319
2320
2321
2013-08-05  Morten Stenshorne  <mstensho@opera.com>

        Region based columns not painted correctly in non-default writing-modes
        https://bugs.webkit.org/show_bug.cgi?id=118506

        Reviewed by David Hyatt.

        * fast/multicol/newmulticol/hide-box-horizontal-bt-expected.html: Added.
        * fast/multicol/newmulticol/hide-box-horizontal-bt.html: Added.
        * fast/multicol/newmulticol/hide-box-vertical-lr-expected.html: Added.
        * fast/multicol/newmulticol/hide-box-vertical-lr.html: Added.
        * fast/multicol/newmulticol/hide-box-vertical-rl-expected.html: Added.
        * fast/multicol/newmulticol/hide-box-vertical-rl.html: Added.

2322
2323
2324
2325
2326
2327
2328
2329
2330
2331
2332
2333
2334
2335
2013-08-05  Morten Stenshorne  <mstensho@opera.com>

        Region based columns not clipped properly
        https://bugs.webkit.org/show_bug.cgi?id=118499

        Reviewed by David Hyatt.

        * fast/multicol/newmulticol/clipping-expected.html: Added.
        * fast/multicol/newmulticol/clipping-overflow-hidden-expected.html: Added.
        * fast/multicol/newmulticol/clipping-overflow-hidden.html: Added.
        * fast/multicol/newmulticol/clipping-top-overflow-expected.html: Added.
        * fast/multicol/newmulticol/clipping-top-overflow.html: Added.
        * fast/multicol/newmulticol/clipping.html: Added.

2336
2337
2338
2339
2340
2341
2342
2343
2344
2345
2346
2347
2348
2349
2350
2351
2352
2353
2354
2355
2356
2357
2358
2359
2360
2361
2362
2363
2364
2365
2366
2367
2368
2369
2370
2371
2372
2373
2374
2375
2376
2377
2378
2379
2380
2381
2382
2383
2384
2385
2386
2387
2388
2389
2390
2391
2392
2393
2394
2395
2396
2013-08-05  Mihai Tica  <mitica@adobe.com>

        Make tests platform agnostic, fix async tests, remove broken blend modes: hue, saturation, color, luminosity, soft-light.
        The test suite should now pass on windows.

        https://bugs.webkit.org/show_bug.cgi?id=119463

        Reviewed by Dirk Schulze.

        * fast/canvas/canvas-blending-clipping-expected.txt:
        * fast/canvas/canvas-blending-clipping.html:
        * fast/canvas/canvas-blending-color-over-color-expected.txt:
        * fast/canvas/canvas-blending-color-over-color.html:
        * fast/canvas/canvas-blending-color-over-gradient-expected.txt:
        * fast/canvas/canvas-blending-color-over-gradient.html:
        * fast/canvas/canvas-blending-color-over-image-expected.txt:
        * fast/canvas/canvas-blending-color-over-image.html:
        * fast/canvas/canvas-blending-color-over-pattern-expected.txt:
        * fast/canvas/canvas-blending-color-over-pattern.html:
        * fast/canvas/canvas-blending-fill-style-expected.txt:
        * fast/canvas/canvas-blending-fill-style.html:
        * fast/canvas/canvas-blending-global-alpha-expected.txt:
        * fast/canvas/canvas-blending-global-alpha.html:
        * fast/canvas/canvas-blending-gradient-over-color-expected.txt:
        * fast/canvas/canvas-blending-gradient-over-color.html:
        * fast/canvas/canvas-blending-gradient-over-gradient-expected.txt:
        * fast/canvas/canvas-blending-gradient-over-gradient.html:
        * fast/canvas/canvas-blending-gradient-over-image-expected.txt:
        * fast/canvas/canvas-blending-gradient-over-image.html:
        * fast/canvas/canvas-blending-gradient-over-pattern-expected.txt:
        * fast/canvas/canvas-blending-gradient-over-pattern.html:
        * fast/canvas/canvas-blending-helpers.js:
        (separateBlendFunctions.hardLight):
        (nonSeparateBlendFunctions.hue):
        (nonSeparateBlendFunctions.saturation):
        (nonSeparateBlendFunctions.color):
        (nonSeparateBlendFunctions.luminosity):
        * fast/canvas/canvas-blending-image-over-color-expected.txt:
        * fast/canvas/canvas-blending-image-over-color.html:
        * fast/canvas/canvas-blending-image-over-gradient-expected.txt:
        * fast/canvas/canvas-blending-image-over-gradient.html:
        * fast/canvas/canvas-blending-image-over-image-expected.txt:
        * fast/canvas/canvas-blending-image-over-image.html:
        * fast/canvas/canvas-blending-image-over-pattern-expected.txt:
        * fast/canvas/canvas-blending-image-over-pattern.html:
        * fast/canvas/canvas-blending-pattern-over-color-expected.txt:
        * fast/canvas/canvas-blending-pattern-over-color.html:
        * fast/canvas/canvas-blending-pattern-over-gradient-expected.txt:
        * fast/canvas/canvas-blending-pattern-over-gradient.html:
        * fast/canvas/canvas-blending-pattern-over-image-expected.txt:
        * fast/canvas/canvas-blending-pattern-over-image.html:
        * fast/canvas/canvas-blending-pattern-over-pattern-expected.txt:
        * fast/canvas/canvas-blending-pattern-over-pattern.html:
        * fast/canvas/canvas-blending-shadow-expected.txt:
        * fast/canvas/canvas-blending-shadow.html:
        * fast/canvas/canvas-blending-text-expected.txt:
        * fast/canvas/canvas-blending-text.html:
        * fast/canvas/canvas-blending-transforms-expected.txt:
        * fast/canvas/canvas-blending-transforms.html:
        * platform/win/TestExpectations:

2397
2398
2399
2400
2401
2402
2403
2404
2405
2406
2407
2408
2013-08-05  Abhijeet Kandalkar  <abhijeet.k@samsung.com>

        Spatial Navigation should avoid unwanted calculation while deciding focus candidate.
        https://bugs.webkit.org/show_bug.cgi?id=117265

        Reviewed by Antonio Gomes.

        Added testcases to count how many target nodes were tested before choosing a final target.

        * fast/spatial-navigation/snav-search-optimization-expected.txt: Added.
        * fast/spatial-navigation/snav-search-optimization.html: Added.

2409
2410
2411
2412
2413
2414
2415
2416
2417
2418
2419
2420
2421
2013-08-05  Mihai Tica  <mitica@adobe.com>

        [CSS Background Blending] Specifying background-image and background-color with opaque
        image doesn't trigger blending. Adding ref test to validate the fix.

        https://bugs.webkit.org/show_bug.cgi?id=119434i

        Reviewed by Dirk Schulze.

        * css3/compositing/background-blend-mode-separate-layer-declaration-expected.html: Added.
        * css3/compositing/background-blend-mode-separate-layer-declaration.html: Added.
        * css3/compositing/resources/gray_square.svg: Added.

2422
2423
2424
2425
2426
2427
2428
2429
2430
2013-08-03  Simon Fraser  <simon.fraser@apple.com>

        webaudio/audiobuffersource-loop-points.html always times out
        https://bugs.webkit.org/show_bug.cgi?id=119467

        Skip this test.

        * platform/mac-wk2/TestExpectations:

2431
2432
2433
2434
2435
2436
2437
2438
2439
2440
2441
2442
2443
2013-08-03  Yoav Weiss  <yoav@yoav.ws>

        PreloadScanner preloads external CSS with non-matching media attribute
        https://bugs.webkit.org/show_bug.cgi?id=106198

        Reviewed by Dean Jackson.

        * http/tests/loading/preload-css-test-expected.txt: Added.
        * http/tests/loading/preload-css-test.html: Added.
        * http/tests/loading/resources/big_mq.css: Added.
        * http/tests/loading/resources/small_mq.css: Added.
        * http/tests/local/link-stylesheet-load-order-preload-expected.txt:

2444
2445
2446
2447
2448
2449
2450
2451
2452
2453
2013-08-02  Benjamin Poulain  <bpoulain@apple.com>

        REGRESSION (r153005): Crash in SpaceSplitString::spaceSplitStringContainsValue on Facebook
        https://bugs.webkit.org/show_bug.cgi?id=119384

        Reviewed by Alexey Proskuryakov.

        * fast/dom/HTMLAnchorElement/remove-rel-attribute.html: Added.
        * fast/dom/HTMLAnchorElement/remove-rel-attribute-expected.txt: Added.

2454
2455
2456
2457
2458
2459
2460
2461
2462
2463
2464
2465
2466
2013-08-02  Dean Jackson  <dino@apple.com>

        Force elements with perspective or preserve-3d to disallow direct composited backgrounds
        https://bugs.webkit.org/show_bug.cgi?id=119462
        <rdar://problem/14607548>

        Reviewed by Simon Fraser.

        * compositing/background-color/no-composited-background-color-when-perspective-expected.html: Added.
        * compositing/background-color/no-composited-background-color-when-perspective.html: Added.
        * compositing/geometry/preserve-3d-switching-expected.txt: Rebaselined.
        * compositing/overflow-trumps-transform-style-expected.txt: Rebaselined.

2467
2468
2469
2470
2471
2472
2473
2474
2475
2476
2477
2478
2479
2013-08-02  Chris Curtis  <chris_curtis@apple.com>

        Give the error object's stack property accessor attributes.
        https://bugs.webkit.org/show_bug.cgi?id=119404

        Reviewed by Geoffrey Garen.

        * fast/dom/DOMException/stack-trace-expected.txt:
        
        New tests to show that the error object's stack property is writable and deleteable.
        * fast/js/error-object-write-and-detele-for-stack-property-expected.txt: Added.
        * fast/js/error-object-write-and-detele-for-stack-property.html: Added.

2480
2481
2482
2483
2484
2485
2486
2013-08-02  Roger Fong  <roger_fong@apple.com>

        Unreviewed. Skip failing canvas blending tests on AppleWin port.
        https://bugs.webkit.org/show_bug.cgi?id=119463.

        * platform/win/TestExpectations:

2487
2488
2489
2490
2491
2492
2493
2494
2495
2496
2497
2498
2499
2500
2501
2502
2013-08-02  Chris Curtis  <chris_curtis@apple.com>

        Have vm's exceptionStack match java's vm's exceptionStack.
        https://bugs.webkit.org/show_bug.cgi?id=119362

        Reviewed by Geoffrey Garen.
        
        All modifications to the tests below are column number changes. If the thrown 
        object was created by the user the column number references the error object, 
        otherwise it references the the throw.
        
        * fast/events/window-onerror5-expected.txt:
        * fast/js/line-column-numbers-expected.txt:
        * fast/js/stack-trace-expected.txt:
        * http/tests/workers/worker-importScriptsOnError-expected.txt:

2503
2504
2505
2506
2507
2508
2509
2013-08-02  Simon Fraser  <simon.fraser@apple.com>

        webaudio/javascriptaudionode-downmix8-2channel-input.html sometimes asserts
        https://bugs.webkit.org/show_bug.cgi?id=119459

        * platform/mac-wk2/TestExpectations:

2510
2511
2512
2513
2514
2515
2516
2517
2518
2519
2520
2521
2522
2523
2524
2525
2526
2527
2528
2529
2530
2531
2532
2013-08-02  Christophe Dumez  <ch.dumez@sisa.samsung.com>

        compareDocumentPosition() should report PRECEDING or FOLLOWING information even if nodes are disconnected
        https://bugs.webkit.org/show_bug.cgi?id=119316

        Reviewed by Ryosuke Niwa.

        Update fast/dom/compare-document-position-disconnected-nodes.html to check that compareDocumentPosition()
        now returns one of the following values for disconnected nodes:
        - DOCUMENT_POSITION_DISCONNECTED | DOCUMENT_POSITION_IMPLEMENTATION_SPECIFIC | DOCUMENT_POSITION_PRECEDING
        - DOCUMENT_POSITION_DISCONNECTED | DOCUMENT_POSITION_IMPLEMENTATION_SPECIFIC | DOCUMENT_POSITION_FOLLOWING

        Several dom/xhtml/level3 are skipped and marked as WonfFix because they are outdated and no longer match
        the DOM4 specification. They expect compareDocumentPosition() not to return PRECEDING / FOLLOWING
        information for disconnected nodes.

        * TestExpectations:
        * dom/xhtml/level3/core/nodecomparedocumentposition38-expected.txt:
        * fast/dom/compare-document-position-disconnected-nodes-expected.txt:
        * fast/dom/compare-document-position-disconnected-nodes.html:
        * fast/dom/shadow/compare-document-position-expected.txt:
        * fast/dom/shadow/compare-document-position.html:

2533
2534
2535
2536
2537
2538
2539
2540
2541
2542
2543
2544
2545
2546
2547
2548
2549
2550
2551
2552
2553
2554
2555
2556
2557
2558
2559
2560
2561
2562
2563
2564
2565
2566
2567
2568
2569
2570
2571
2572
2573
2574
2575
2576
2577
2578
2579
2580
2581
2582
2583
2584
2585
2586
2587
2588
2589
2590
2591
2592
2593
2594
2595
2596
2597
2598
2599
2600
2601
2602
2603
2604
2605
2606
2607
2608
2609
2610
2611
2612
2613
2614
2615
2616
2617
2618
2619
2620
2621
2622
2623
2624
2625
2626
2627
2628
2629
2630
2631
2013-08-02  Mihai Tica  <mitica@adobe.com>

        Implement canvas blending test that should validate the following scenarios:
        Validate that all blending operators work as expected for the following layer combinations:

        https://bugs.webkit.org/show_bug.cgi?id=119082

        Reviewed by Dirk Schulze.

        * fast/canvas/canvas-blending-clipping-expected.txt: Added.
        * fast/canvas/canvas-blending-clipping.html: Added.
        * fast/canvas/canvas-blending-color-over-color-expected.txt: Added.
        * fast/canvas/canvas-blending-color-over-color.html: Added.
        * fast/canvas/canvas-blending-color-over-gradient-expected.txt: Added.
        * fast/canvas/canvas-blending-color-over-gradient.html: Added.
        * fast/canvas/canvas-blending-color-over-image-expected.txt: Added.
        * fast/canvas/canvas-blending-color-over-image.html: Added.
        * fast/canvas/canvas-blending-color-over-pattern-expected.txt: Added.
        * fast/canvas/canvas-blending-color-over-pattern.html: Added.
        * fast/canvas/canvas-blending-fill-style-expected.txt: Added.
        * fast/canvas/canvas-blending-fill-style.html: Added.
        * fast/canvas/canvas-blending-global-alpha-expected.txt: Added.
        * fast/canvas/canvas-blending-global-alpha.html: Added.
        * fast/canvas/canvas-blending-gradient-over-color-expected.txt: Added.
        * fast/canvas/canvas-blending-gradient-over-color.html: Added.
        * fast/canvas/canvas-blending-gradient-over-gradient-expected.txt: Added.
        * fast/canvas/canvas-blending-gradient-over-gradient.html: Added.
        * fast/canvas/canvas-blending-gradient-over-image-expected.txt: Added.
        * fast/canvas/canvas-blending-gradient-over-image.html: Added.
        * fast/canvas/canvas-blending-gradient-over-pattern-expected.txt: Added.
        * fast/canvas/canvas-blending-gradient-over-pattern.html: Added.
        * fast/canvas/canvas-blending-helpers.js: Added.
        (separateBlendFunctions.normal):
        (separateBlendFunctions.multiply):
        (separateBlendFunctions.screen):
        (separateBlendFunctions.overlay):
        (separateBlendFunctions.darken):
        (separateBlendFunctions.lighten):
        (separateBlendFunctions.colorDodge):
        (separateBlendFunctions.colorBurn):
        (separateBlendFunctions.hardLight):
        (separateBlendFunctions.softLight):
        (separateBlendFunctions.difference):
        (separateBlendFunctions.exclusion):
        (applyBlendMode):
        (luminosity):
        (clipColor):
        (setLuminosity):
        (saturation):
        (setSaturation):
        (nonSeparateBlendFunctions.hue):
        (nonSeparateBlendFunctions.saturation):
        (nonSeparateBlendFunctions.color):
        (nonSeparateBlendFunctions.luminosity):
        (drawColorInContext):
        (drawBackdropColorInContext):
        (drawSourceColorInContext):
        (fillPathWithColorInContext):
        (fillPathWithBackdropInContext):
        (fillPathWithSourceInContext):
        (applyTransformsToContext):
        (drawBackdropColorWithShadowInContext):
        (drawSourceColorRectOverShadow):
        (.backdropImage.onload):
        (drawColorImageInContext):
        (drawBackdropColorImageInContext):
        (drawSourceColorImageInContext):
        (drawColorPatternInContext):
        (drawBackdropColorPatternInContext):
        (drawSourceColorPatternInContext):
        (drawGradientInContext):
        (drawBackdropColorGradientInContext):
        (drawSourceColorGradientInContext):
        (blendColors):
        (separateBlendColors):
        (nonSeparateBlendColors):
        * fast/canvas/canvas-blending-image-over-color-expected.txt: Added.
        * fast/canvas/canvas-blending-image-over-color.html: Added.
        * fast/canvas/canvas-blending-image-over-gradient-expected.txt: Added.
        * fast/canvas/canvas-blending-image-over-gradient.html: Added.
        * fast/canvas/canvas-blending-image-over-image-expected.txt: Added.
        * fast/canvas/canvas-blending-image-over-image.html: Added.
        * fast/canvas/canvas-blending-image-over-pattern-expected.txt: Added.
        * fast/canvas/canvas-blending-image-over-pattern.html: Added.
        * fast/canvas/canvas-blending-pattern-over-color-expected.txt: Added.
        * fast/canvas/canvas-blending-pattern-over-color.html: Added.
        * fast/canvas/canvas-blending-pattern-over-gradient-expected.txt: Added.
        * fast/canvas/canvas-blending-pattern-over-gradient.html: Added.
        * fast/canvas/canvas-blending-pattern-over-image-expected.txt: Added.
        * fast/canvas/canvas-blending-pattern-over-image.html: Added.
        * fast/canvas/canvas-blending-pattern-over-pattern-expected.txt: Added.
        * fast/canvas/canvas-blending-pattern-over-pattern.html: Added.
        * fast/canvas/canvas-blending-shadow-expected.txt: Added.
        * fast/canvas/canvas-blending-shadow.html: Added.
        * fast/canvas/canvas-blending-text-expected.txt: Added.
        * fast/canvas/canvas-blending-text.html: Added.
        * fast/canvas/canvas-blending-transforms-expected.txt: Added.
        * fast/canvas/canvas-blending-transforms.html: Added.

2632
2633
2634
2635
2636
2637
2638
2639
2640
2641
2642
2643
2644
2645
2013-08-02  Brady Eidson  <beidson@apple.com>

        REGRESSION (r130783): Scrolling is broken going back to a cached page from a page that still has outstanding subresources.
        <rdar://problem/14601124> and https://bugs.webkit.org/show_bug.cgi?id=119416

        Reviewed by Darin Adler.

        * http/tests/loading/resources/page-with-slow-loading-subresource.html: Added.
        * http/tests/loading/resources/slowimage.php: Added.
        * http/tests/loading/unfinished-load-back-to-cached-page-callbacks-expected.txt:
        * http/tests/loading/unfinished-load-back-to-cached-page-callbacks.html:
        * http/tests/loading/unfinished-main-resource-back-to-cached-page-callbacks-expected.txt: Copied from LayoutTests/http/tests/loading/unfinished-load-back-to-cached-page-callbacks-expected.txt.
        * http/tests/loading/unfinished-main-resource-back-to-cached-page-callbacks.html: Copied from LayoutTests/http/tests/loading/unfinished-load-back-to-cached-page-callbacks.html.

2646
2647
2648
2649
2650
2651
2652
2653
2654
2655
2656
2657
2658
2659
2660
2661
2662
2663
2664
2665
2666
2667
2668
2669
2670
2671
2672
2673
2674
2675
2676
2677
2678
2679
2680
2681
2682
2683
2684
2685
2686
2687
2688
2689
2690
2691
2692
2693
2694
2695
2696
2697
2698
2699
2700
2701
2702
2013-08-02  Antoine Quint  <graouts@apple.com>

        <input type="search"> doesn't correctly handle the "size" attribute
        https://bugs.webkit.org/show_bug.cgi?id=119174

        New test fast/forms/search/search-size-with-decorations.html that checks the different
        decorations for search fields and the resulting sizes.

        Also rebaselining the following tests since the rendering of search fields changed:

        fast/forms/search-cancel-button-style-sharing.html
        fast/forms/search-display-none-cancel-button.html
        fast/forms/searchfield-heights.html
        fast/forms/control-restrict-line-height.html
        fast/forms/placeholder-pseudo-style.html
        fast/forms/search-rtl.html
        fast/css/text-overflow-input.html
        fast/forms/placeholder-position.html
        fast/repaint/search-field-cancel.html
        fast/forms/input-appearance-height.html
        fast/forms/search-vertical-alignment.html
        fast/forms/box-shadow-override.html
        fast/forms/search/search-size-with-decorations.html
        fast/css/input-search-padding.html
        fast/forms/search-styled.html

        Reviewed by Darin Adler.

        * fast/forms/placeholder-position-expected.txt:
        * fast/forms/search/search-size-with-decorations-expected.txt: Added.
        * fast/forms/search/search-size-with-decorations.html: Added.
        * fast/repaint/search-field-cancel-expected.txt:
        * platform/mac/fast/css/input-search-padding-expected.txt:
        * platform/mac/fast/css/text-overflow-input-expected.png:
        * platform/mac/fast/css/text-overflow-input-expected.txt:
        * platform/mac/fast/forms/box-shadow-override-expected.png:
        * platform/mac/fast/forms/box-shadow-override-expected.txt:
        * platform/mac/fast/forms/control-restrict-line-height-expected.png:
        * platform/mac/fast/forms/control-restrict-line-height-expected.txt:
        * platform/mac/fast/forms/input-appearance-height-expected.png:
        * platform/mac/fast/forms/input-appearance-height-expected.txt:
        * platform/mac/fast/forms/placeholder-position-expected.png:
        * platform/mac/fast/forms/placeholder-pseudo-style-expected.png:
        * platform/mac/fast/forms/placeholder-pseudo-style-expected.txt:
        * platform/mac/fast/forms/search-cancel-button-style-sharing-expected.png:
        * platform/mac/fast/forms/search-cancel-button-style-sharing-expected.txt:
        * platform/mac/fast/forms/search-display-none-cancel-button-expected.txt:
        * platform/mac/fast/forms/search-rtl-expected.png:
        * platform/mac/fast/forms/search-rtl-expected.txt:
        * platform/mac/fast/forms/search-styled-expected.txt:
        * platform/mac/fast/forms/search-vertical-alignment-expected.png:
        * platform/mac/fast/forms/search-vertical-alignment-expected.txt:
        * platform/mac/fast/forms/search/search-size-with-decorations-expected.png: Added.
        * platform/mac/fast/forms/searchfield-heights-expected.png:
        * platform/mac/fast/forms/searchfield-heights-expected.txt:
        * platform/mac/fast/repaint/search-field-cancel-expected.png:

2703
2704
2705
2706
2707
2708
2709
2710
2711
2712
2713
2714
2715
2716
2717
2013-08-02  Zalan Bujtas  <zalan@apple.com>

        Frame flattening: Change the logic on whether resize event needs to be dispatched.
        https://bugs.webkit.org/show_bug.cgi?id=119394

        Reviewed by Simon Fraser.

        http://trac.webkit.org/changeset/149287 changed the logic so that resize events are
        sent out from FrameView::setFrameRect() too. Checking whether frame flattening is
        enabled is sufficient enough to ensure that no extra resize events are dispatched.

        * fast/frames/flattening/iframe-flattening-resize-event-count-expected.txt: Added.
        * fast/frames/flattening/iframe-flattening-resize-event-count.html: Added.
        * fast/frames/flattening/resources/iframe-to-resize.html: Added.

2718
2719
2720
2721
2722
2723
2724
2725
2726
2727
2728
2729
2013-08-01  Commit Queue  <commit-queue@webkit.org>

        Unreviewed, rolling out r153608.
        http://trac.webkit.org/changeset/153608
        https://bugs.webkit.org/show_bug.cgi?id=119425

        Snorkled fast/multicol/overflow-content-expected.html
        (Requested by kling on #webkit).

        * fast/css/identical-logical-height-decl-expected.html: Removed.
        * fast/css/identical-logical-height-decl.html: Removed.

2730
2731
2732
2733
2734
2735
2736
2737
2738
2739
2740
2741
2742
2743
2744
2745
2746
2747
2748
2013-08-01  Rob Buis  <rwlbuis@webkit.org>

        selectors should match attribute name with case sensitivity based on element & document type
        https://bugs.webkit.org/show_bug.cgi?id=71152

        Reviewed by Darin Adler.

        Results matches FireFox nightly.

        * fast/dom/SelectorAPI/attrname-case-insensitive-expected.txt: Added.
        * fast/dom/SelectorAPI/attrname-case-insensitive.html: Check that in HTML documents CSS selectors
        use case-insensitive attribute name matching for HTML elements, case-sensitive otherwise.
        * fast/dom/SelectorAPI/attrname-case-sensitive-expected.txt: Added.
        * fast/dom/SelectorAPI/attrname-case-sensitive.xhtml: Check that in XHTML documents CSS selectors
        always use case-sensitive attribute name matching.
        * svg/css/case-sensitive-attrname-selectors-expected.txt: Added.
        * svg/css/case-sensitive-attrname-selectors.html: Check that in HTML documents CSS selectors in stylesheets
        use case-insensitive attribute name matching for HTML elements, case-sensitive otherwise.

2749
2750
2751
2752
2753
2754
2755
2756
2757
2758
2013-08-01  Alexey Proskuryakov  <ap@apple.com>

        <rdar://problem/14625616> http/tests/download/basic-ascii.html and http/tests/download/literal-utf-8.html fails

        Changed the PHP files to not have a BOM, which confuses some versions of PHP.
        They are both ASCII anyway.

        * http/tests/download/resources/basic-ascii.php:
        * http/tests/download/resources/literal-utf-8.php:

2759
2760